program: Gaussian 09
title: 000196383
version: EM64L-G09RevD.01
frameworkgroup: C1[X(C10H17N3O6)]
method: RPBEPBE
basis: SDD
operation: Freq
keyword: #p
keyword: freq=noraman
keyword: PBEPBE/SDD
title: #p freq=noraman PBEPBE/SDD
converged: YES YES NO NO
title: Mulliken charges:
elementType: O O O O O O N N N C C C C C C C C C C H H H H H H H H H H H H H H H H H
charge: -0.478496 -0.450013 -0.179404 -0.514590 -0.415867 -0.315050 -0.376683 -0.182142 -0.633128 -0.099716 -0.162576 -0.121975 -0.206887 -0.094934 0.027678 0.402257 0.284080 -0.786939 -0.770119 0.297398 0.303355 0.290405 0.273322 0.339754 0.192327 0.376094 0.360117 0.328809 0.224389 0.252559 0.253350 0.224078 0.255039 0.317433 0.404279 0.381796
chargesum: 0.00000
title: Mulliken charges with hydrogens summed into heavy atoms:
elementType: O O O O O O N N N C C C C C C C C C C
charge: -0.102403 -0.089896 -0.179404 -0.132794 -0.415867 -0.315050 -0.036929 -0.182142 0.088584 0.197682 0.140780 0.168430 0.066435 0.097393 0.027678 0.402257 0.284080 0.018818 -0.037651
polarizability: 1.44995633e+02 8.86422212e-01 1.60998314e+02 2.50635537e+00 1.13944252e+00 1.35995936e+02
1716.lowfreq: -3.6654 -0.0007 -0.0006 -0.0003 7.6445 15.2068 29.4558 45.6861 56.8577
frequency: 29.2783 45.5195 56.8254 78.4047 84.0902 104.6693 112.2422 125.4038 152.9377 170.4418 177.2310 195.0199 217.3302 252.8168 260.4910 265.0338 271.3624 285.6984 328.6920 347.6629 351.6954 367.2153 422.5461 441.7789 449.2557 471.6528 501.2871 513.7451 538.0725 547.7992 549.4293 583.9780 599.7411 610.6713 619.9566 672.6937 691.3326 718.4335 731.5645 791.7342 842.5157 861.7353 871.4130 912.0230 934.2779 946.6914 966.0775 996.5583 1012.1477 1015.9326 1033.8852 1039.9502 1040.6127 1046.7470 1059.3644 1074.7237 1077.5050 1121.1099 1163.1604 1178.8095 1214.2566 1227.6102 1241.6934 1255.1358 1290.5405 1292.4806 1296.1214 1312.0763 1322.0638 1336.7639 1365.3135 1369.2178 1389.3332 1417.9660 1447.0557 1458.6639 1467.5514 1471.8064 1474.8380 1481.0554 1502.9834 1560.2449 1592.2805 1634.3384 1652.3958 2860.2443 2898.2483 2963.3671 2969.3045 3002.2236 3008.7132 3025.2105 3066.0580 3098.3287 3104.2891 3113.8492 3119.0763 3174.7012 3447.9929 3471.0655 3569.4515 3616.6573
redmass: 2.9859 2.4468 2.4105 5.3741 3.0767 4.8670 5.7947 3.5261 5.6773 4.2103 4.5658 5.3455 6.3486 5.7879 3.2245 2.0921 1.0986 4.4455 5.2325 2.3093 4.6070 4.5533 4.1850 4.1402 3.3067 3.3875 1.3709 4.0583 3.8952 4.3240 1.8259 3.4377 3.5470 2.1599 2.5594 1.6290 3.9445 3.6823 3.6652 3.8525 4.4022 1.3780 1.7477 4.0881 4.2964 2.6118 1.8824 1.6095 1.8059 2.4313 1.5450 2.8272 2.3324 1.9770 3.0273 1.5718 2.5724 1.6866 4.1041 1.3705 1.8618 1.4738 1.3471 1.3216 1.6467 1.4471 1.4078 1.3880 1.3009 2.0255 1.3177 1.5042 1.2393 1.1887 1.1784 1.2595 1.1462 1.1845 1.4571 1.5830 1.9390 1.5731 5.8632 8.8426 3.0944 1.0786 1.0872 1.0486 1.0731 1.0360 1.0834 1.0866 1.0925 1.0980 1.0996 1.1009 1.0874 1.0687 1.0645 1.0785 1.0655 1.0827
irintensity: 0.1330 1.0350 1.3877 10.7395 0.0249 8.9556 5.8911 6.9963 2.9190 29.8534 2.0333 6.8332 12.2491 3.5238 5.3017 45.9582 0.3577 1.9273 3.7315 8.4168 34.5619 21.2539 11.7995 23.2275 13.6669 12.9688 107.3717 1.9462 12.3319 7.9208 54.5886 13.2821 22.8593 57.0420 82.9073 239.4581 12.2507 61.0468 81.3743 31.6845 89.7418 77.5566 66.7654 16.2742 8.4586 56.9419 64.8556 38.5924 9.5971 240.0953 7.8669 16.2455 10.6273 19.5199 40.4559 26.0000 19.2889 18.9068 10.2583 23.0737 2.9747 8.9647 6.2312 22.0417 53.4436 32.7487 20.3146 17.7516 5.1860 146.7239 3.2853 24.1659 62.2545 43.5272 94.7797 92.4203 47.3437 20.8879 121.0019 89.0387 52.9433 18.4831 105.4920 206.7305 536.8253 397.6654 92.1948 39.7399 41.9922 6.0565 4.5146 36.3770 7.4623 10.0337 17.7288 13.3412 28.7139 197.4285 21.0740 136.7625 25.4611 70.9845
temp: 298.150 k
press: 1.00000 atm
elementType: 8 8 8 8 8 8 7 7 7 6 6 6 6 6 6 6 6 6 6 1 1 1 1 1 1 1 1 1 1 1 1 1 1 1 1 1
symmnumber: 1
zpe: 738775.0 jmol-1
zpe.correction: 0.281385 hartree
zpe.thermalcorrener: 0.301347 hartree
zpe.thermalcorrenthalpy: 0.302291 hartree
zpe.thermalcorrgfe: 0.233452 hartree
zpe.sumelectzpe: -1005.382852 hartree
zpe.sumelectthermal: -1005.362890 hartree
zpe.sumelectthermalent: -1005.361945 hartree
zpe.sumelectthermalfe: -1005.430785 hartree
dipole: 1.2978 -4.6306 0.0877
dipole: 4.8098
quadrupole: -120.3951 -119.2802 -102.4750
quadrupole: 7.8255 6.7161 7.4362
quadrupole: -6.3450 -5.2301 11.5751 7.8255 6.7161 7.4362
hfenergy: -1005.6642362 hartree
pointgroup: C01 [X(C10H17N3O6)]
dipole: 0.6131391 -1.778743 -0.2024896 debye
polarizability: 145.0415526|-0.2774966|160.3337561|2.238158|4.3667564|136.6145738 unknown
InChI: InChI=1S/C10H17N3O6/c1-4(11)13-7(6(3-14)12-5(2)15)8(16)9(17)10(13,18)19/h3,6-9,12,16-18H,11H2,1-2H3
charge 0 multiplicity 1
36 atoms
O  -0.045012 1.601155 1.844614
O  -3.048388 1.365876 -0.340694
O  1.202554 3.385162 -1.256905
O  -0.993518 -0.865809 1.884519
O  -2.830818 -1.350183 0.423831
O  2.966839 -1.338064 -0.738771
N  2.057839 0.374835 0.541978
N  -0.716832 -0.438303 -0.509899
N  -1.349979 -2.536023 -1.273222
C  -0.145255 0.933885 -0.606393
C  -0.811042 1.702997 0.588157
C  1.410275 1.013467 -0.601884
C  -2.166874 1.002877 0.762056
C  1.881933 2.468062 -0.742782
C  -1.826405 -0.510193 0.643252
C  -0.604194 -1.417776 -1.42617
C  2.765415 -0.80462 0.40322
C  0.329363 -1.318331 -2.607917
C  3.278512 -1.428092 1.691017
H  -0.50058 1.425204 -1.533304
H  -0.900237 2.771865 0.354313
H  1.818538 0.486401 -1.490832
H  -2.623097 1.220456 1.745777
H  1.756275 0.73211 1.456335
H  2.920197 2.638071 -0.362056
H  -0.303384 0.707371 2.2455
H  -3.667127 0.590292 -0.452427
H  1.375719 -1.465447 -2.275541
H  0.081235 -2.089947 -3.354989
H  0.251518 -0.331113 -3.095472
H  4.340455 -1.69677 1.566121
H  3.171063 -0.763472 2.564287
H  2.721397 -2.361683 1.885238
H  -1.282465 -3.285135 -1.958639
H  -2.117614 -2.462177 -0.539757
H  -1.547508 -1.531749 2.36714
