program: Gaussian 09
title: 000188088
version: EM64L-G09RevD.01
frameworkgroup: C1[X(C19H19ClF3NO4)]
method: RPBEPBE
basis: SDD
operation: Freq
keyword: #p
keyword: freq=noraman
keyword: PBEPBE/SDD
title: #p freq=noraman PBEPBE/SDD
converged: YES YES NO NO
title: Mulliken charges:
elementType: Cl F F F O O O O N C C C C C C C C C C C C C C C C C C C H H H H H H H H H H H H H H H H H H H
charge: 0.007109 -0.163518 -0.160384 -0.161459 -0.269547 -0.266763 -0.265828 -0.206712 -0.065460 -0.342103 -0.350222 -0.309518 -0.111292 0.241151 -0.685221 -0.719354 0.366115 -0.362754 -0.328957 0.332894 -0.384598 -0.312247 0.270623 0.296585 -0.266173 -0.187111 -0.428001 0.260403 0.233895 0.198662 0.203795 0.193271 0.231327 0.225113 0.244062 0.217954 0.219997 0.210707 0.253079 0.219765 0.242846 0.259435 0.264188 0.266340 0.311957 0.293900 0.282049
chargesum: 0.00000
title: Mulliken charges with hydrogens summed into heavy atoms:
elementType: Cl F F F O O O O N C C C C C C C C C C C C C C C C C C C
charge: 0.007109 -0.163518 -0.160384 -0.161459 -0.269547 -0.266763 -0.265828 -0.206712 -0.065460 0.090455 0.046843 0.146922 0.132770 0.241151 -0.036563 -0.003663 0.366115 -0.103319 -0.064769 0.332894 -0.118258 -0.000291 0.270623 0.296585 -0.266173 0.106788 -0.145952 0.260403
polarizability: 3.59233872e+02 3.35373620e+01 2.56698327e+02 1.87455752e+01 -3.33113022e+01 1.59622177e+02
1716.lowfreq: -6.9331 -3.0077 0.0016 0.0020 0.0022 1.5263 5.8781 8.4926 14.0693
frequency: -5.3395 8.4343 14.0295 17.9866 30.4733 43.0020 46.9067 59.5084 60.9214 70.8310 83.4571 107.1754 109.4877 131.3859 136.1995 152.8347 171.2486 184.9286 204.8407 214.0609 227.1869 233.7143 243.4792 250.1444 270.1868 291.8158 303.2097 328.5742 361.0448 370.3379 382.6891 393.9509 407.6377 420.5550 426.3935 443.8900 466.6472 485.0598 513.8760 522.6341 525.5180 577.6527 608.7304 610.7606 632.3553 650.1226 652.6499 699.6824 708.2463 713.9068 735.7106 744.0343 755.7700 784.4455 801.3890 817.6234 825.2398 841.9964 888.4550 892.7150 902.1041 902.8394 921.4305 926.6122 944.5733 957.3201 971.4006 981.2894 999.3790 1001.6682 1027.1017 1028.0586 1032.2177 1053.4515 1074.2527 1075.2205 1094.5517 1112.9267 1118.0514 1142.6028 1143.9555 1164.6310 1184.4572 1213.2593 1215.1794 1227.2273 1273.5795 1288.6334 1290.7259 1293.8229 1296.9304 1303.1965 1322.1157 1325.9257 1336.4674 1346.8233 1367.9851 1373.8971 1389.3623 1391.0316 1392.1198 1423.2971 1448.9277 1453.5384 1461.8849 1470.4904 1473.8917 1476.2051 1478.2511 1482.0641 1488.6094 1523.5914 1585.2739 1590.9861 1613.2101 1655.1637 2970.1116 2977.9040 2991.0151 3002.6224 3015.7003 3017.4968 3022.3099 3053.4608 3075.6018 3079.0525 3104.4235 3104.9065 3117.2947 3162.4441 3162.5714 3164.3681 3176.2527 3182.3456 3210.6711
redmass: 13.8088 6.0186 5.7677 4.4644 6.0264 7.9348 5.5422 2.9739 3.7580 2.4583 7.7922 2.8025 4.1857 14.8944 6.9128 6.9177 5.9005 4.4643 2.6163 3.4142 1.3252 1.5857 2.7035 4.5967 7.4680 7.2433 4.8579 5.9204 7.2520 6.7380 9.9078 3.9888 10.0831 3.2031 4.6657 5.0892 5.8701 6.9495 2.8073 7.2696 5.8207 8.7383 6.3079 7.0337 7.4611 6.6579 4.8452 8.1108 5.6332 4.7316 6.3443 1.0735 5.6939 1.7661 6.4282 1.7423 1.3029 1.5697 4.8581 7.0165 1.4453 1.9534 1.4328 3.0146 1.2669 1.3290 1.3175 10.5529 4.9870 4.2634 2.5203 8.6879 3.1944 3.2840 2.3943 2.3349 2.7599 1.3263 2.4857 2.3245 2.2367 1.7447 1.4192 3.4909 2.2689 1.3117 1.2614 1.1579 1.9640 1.0749 3.4802 1.7637 1.3269 1.3811 4.1026 1.4338 1.4167 5.4444 1.7456 2.0594 1.2174 3.7543 4.0433 1.0937 1.0445 1.0709 1.0545 1.0535 1.0514 2.3734 1.0888 8.2676 6.3559 8.0358 6.3401 9.2588 1.0588 1.0365 1.0606 1.0351 1.0996 1.0851 1.0585 1.1028 1.1009 1.0997 1.0999 1.1081 1.1015 1.0890 1.0924 1.0906 1.0942 1.0977 1.0942
irintensity: 0.0472 0.0509 0.1099 0.8622 0.0301 0.0997 1.1793 0.2259 0.5269 0.0862 0.5259 0.3449 0.0357 2.0349 1.5917 1.9218 0.3567 2.7388 1.6977 1.1926 0.5241 1.3601 1.0247 0.9009 5.8265 2.8619 8.1451 1.3143 0.1448 3.1479 1.6899 2.7242 3.3423 0.0461 9.5074 0.1586 12.8185 0.0415 15.3847 6.6045 1.7267 8.0253 23.4867 13.3923 8.3301 7.4272 8.9538 13.0542 3.7008 0.0992 14.7843 9.3731 36.2074 4.4585 30.7633 4.6008 1.9964 104.1728 22.7962 10.9183 43.8084 4.8943 25.1188 57.2448 3.0328 0.3683 0.3225 232.2629 72.9463 246.6511 31.9286 43.5171 27.8134 95.8283 157.0386 103.0124 102.6300 40.2328 11.0755 26.2322 26.0043 8.3680 251.0870 288.7970 29.2067 2.3647 2.9631 0.4988 89.4693 1.5709 690.1317 59.0513 2.1684 25.6170 10.6266 2.9923 0.9360 60.7571 127.1258 31.5513 12.6491 14.6106 215.2923 7.1254 14.8209 2.3025 11.8077 5.3560 10.0079 340.9615 30.0249 1.6444 204.4737 39.0643 58.1483 121.7343 31.6228 24.0113 30.1813 15.0486 9.4152 16.7758 50.5600 6.4267 58.8218 51.4257 21.1577 24.9027 13.1084 6.8612 1.8753 1.4761 2.1849 2.2765 7.1066
temp: 298.150 k
press: 1.00000 atm
elementType: 17 9 9 9 8 8 8 8 7 6 6 6 6 6 6 6 6 6 6 6 6 6 6 6 6 6 6 6 1 1 1 1 1 1 1 1 1 1 1 1 1 1 1 1 1 1 1
symmnumber: 1
zpe: 910849.0 jmol-1
zpe.correction: 0.346924 hartree
zpe.thermalcorrener: 0.374295 hartree
zpe.thermalcorrenthalpy: 0.375239 hartree
zpe.thermalcorrgfe: 0.283830 hartree
zpe.sumelectzpe: -1848.568512 hartree
zpe.sumelectthermal: -1848.541142 hartree
zpe.sumelectthermalent: -1848.540197 hartree
zpe.sumelectthermalfe: -1848.631606 hartree
dipole: -2.9598 1.2279 -1.5645
dipole: 3.5659
quadrupole: -177.5663 -163.0609 -172.4551
quadrupole: -16.3724 14.6365 1.1418
quadrupole: -6.5389 7.9665 -1.4276 -16.3724 14.6365 1.1418
hfenergy: -1848.9154363 hartree
pointgroup: C01 [X(C19H19Cl1F3N1O4)]
dipole: -1.1601257 0.2740878 -0.7397587 debye
polarizability: 313.0558572|44.0102618|289.9373965|67.1599102|20.6653761|172.5611226 unknown
InChI: InChI=1S/C19H19ClF3NO4/c1-3-4-9-26-18(25)12(2)27-14-5-7-15(8-6-14)28-17-16(20)10-13(11-24-17)19(21,22)23/h5-8,10-12H,3-4,9H2,1-2H3
charge 0 multiplicity 1
47 atoms
Cl 4.232238 -1.624276 1.738368
F  5.805981 3.512692 0.950821
F  3.966755 4.663041 0.258491
F  4.237613 4.154955 2.450682
O  -5.021437 0.227962 -1.593486
O  -3.324102 -2.868119 -1.735971
O  1.609984 -1.209637 0.413838
O  -5.511026 -1.559606 -0.164821
N  1.715217 1.161011 0.12364
C  -4.697361 1.661751 0.426336
C  -5.345982 2.701488 1.371948
C  -5.684857 1.182831 -0.644918
C  -4.328107 -1.957506 -2.315769
C  -5.004992 -1.116171 -1.215282
C  -4.362281 3.200017 2.45223
C  -5.359271 -2.861839 -2.999637
C  -2.133367 -2.32125 -1.222181
C  -1.221433 -3.2710 -0.695898
C  -1.80678 -0.94436 -1.215145
C  0.327194 -1.465712 -0.167689
C  0.006334 -2.843933 -0.168845
C  -0.568864 -0.508182 -0.68623
C  2.249901 -0.008455 0.55482
C  3.681279 2.349449 0.914085
C  3.534536 -0.055099 1.185719
C  4.251505 1.128831 1.367787
C  2.413806 2.315587 0.299073
C  4.404421 3.640652 1.130849
H  -4.347432 0.792888 1.014735
H  -3.81093 2.108757 -0.064933
H  -6.233193 2.250995 1.860933
H  -5.715043 3.563797 0.780041
H  -6.553839 0.674691 -0.18873
H  -6.020196 2.006295 -1.296587
H  -3.847494 -1.275999 -3.042937
H  -4.000544 2.360761 3.074622
H  -4.842418 3.936226 3.121931
H  -3.479509 3.684184 1.994333
H  -5.823746 -3.529932 -2.255743
H  -6.146963 -2.255392 -3.480111
H  -4.861301 -3.472908 -3.770467
H  -1.495453 -4.32949 -0.70778
H  -2.497567 -0.191957 -1.606399
H  0.724488 -3.557326 0.244872
H  -0.306508 0.549028 -0.678999
H  5.237323 1.109882 1.840436
H  1.941617 3.228877 -0.07443
