program: Gaussian 09
title: 000188086
version: EM64L-G09RevD.01
frameworkgroup: C1[X(C8H16N2O2)]
method: RPBEPBE
basis: SDD
operation: Freq
keyword: #p
keyword: freq=noraman
keyword: PBEPBE/SDD
title: #p freq=noraman PBEPBE/SDD
converged: YES YES NO NO
title: Mulliken charges:
elementType: O O N N C C C C C C C C H H H H H H H H H H H H H H H H
charge: -0.198964 -0.283507 -0.061026 0.058108 -0.349398 -0.339070 -0.382555 -0.355211 -0.491640 -0.691196 0.242219 -0.757938 0.202895 0.217014 0.190139 0.192804 0.217880 0.246714 0.199023 0.202299 0.256242 0.270522 0.220559 0.211345 0.210962 0.250134 0.267029 0.254617
chargesum: 0.00000
title: Mulliken charges with hydrogens summed into heavy atoms:
elementType: O O N N C C C C C C C C
charge: -0.198964 -0.283507 -0.061026 0.058108 0.070511 0.043874 0.082039 0.046111 0.035124 -0.048331 0.242219 0.013843
polarizability: 1.27891099e+02 -6.71970453e+00 1.12173431e+02 7.84122269e+00 -6.58969994e+00 9.11036643e+01
1716.lowfreq: -22.2282 -11.1801 -5.3209 0.0007 0.0007 0.0008 15.7523 31.4581 50.2591
frequency: -3.8249 31.2971 50.2326 56.0155 84.7266 97.2381 123.5752 126.5270 137.5995 212.0355 224.4331 257.1050 303.1178 332.8488 351.9970 376.6575 433.6938 473.3303 485.7368 555.0472 682.9202 731.3853 756.4980 762.7449 828.3978 835.6603 895.4883 896.5117 947.7791 980.7810 1005.5969 1015.4455 1045.0253 1055.1366 1077.0873 1115.9338 1144.8219 1187.8044 1218.9662 1225.5572 1249.1008 1276.9653 1288.5602 1293.4406 1311.1544 1318.6331 1326.2865 1336.9822 1352.8310 1362.3911 1376.7954 1388.8767 1408.5608 1445.0736 1448.0226 1455.2652 1465.2280 1470.7125 1476.8076 1479.7007 1488.0392 1638.0915 2957.1301 2957.8488 2970.8579 2974.3325 2977.0486 2985.5417 2986.0184 2998.5955 3023.8036 3042.8009 3068.2430 3070.5650 3074.3639 3075.5294 3082.9952 3128.8468
redmass: 1.7214 4.3904 3.4153 4.9389 4.4561 2.2981 1.9746 1.1906 2.6438 3.8700 1.1284 5.2134 6.0426 3.0426 3.5520 2.7095 2.3784 3.4598 4.2481 3.2566 4.8138 1.0690 1.1529 3.4926 2.4724 1.2808 2.8876 1.8872 1.5617 1.7591 2.1628 2.6910 2.4663 2.1178 2.4285 2.4169 1.8296 2.0998 3.5591 1.6425 1.3132 1.4646 1.0669 1.2649 1.5453 1.5994 1.8746 1.5343 1.5882 1.4305 1.2563 1.2137 1.1118 1.0715 1.0602 1.0789 1.0689 1.0712 1.0425 1.0738 1.0901 7.8498 1.0587 1.0628 1.0592 1.0363 1.0608 1.0528 1.0466 1.0987 1.1021 1.1025 1.0949 1.1007 1.1006 1.0992 1.0962 1.1011
irintensity: 0.0179 0.3828 0.1137 10.0661 5.4468 1.0445 0.3751 0.2995 2.0978 1.0523 0.0140 3.0447 0.2501 3.6019 1.8474 9.7883 2.6614 3.9150 13.9551 8.7023 4.7689 11.6567 1.4983 3.5196 0.2790 6.7448 58.8941 7.8921 24.7317 30.2834 7.6379 36.0261 19.4969 1.5978 1.0745 4.8658 8.6747 9.0881 92.0788 13.8114 0.6098 20.0221 2.3293 6.7531 36.2289 34.9343 79.9886 10.3701 0.7256 8.4295 74.0808 11.0739 17.1927 30.9518 24.7397 6.1372 1.0547 2.2342 13.3428 4.1933 23.3942 157.3421 9.1414 18.5992 27.2439 36.7141 11.7125 46.2589 37.4562 1.1578 5.3059 32.2543 7.0763 46.5425 58.5436 46.6818 9.0757 8.7037
temp: 298.150 k
press: 1.00000 atm
elementType: 8 8 7 7 6 6 6 6 6 6 6 6 1 1 1 1 1 1 1 1 1 1 1 1 1 1 1 1
symmnumber: 1
zpe: 617002.7 jmol-1
zpe.correction: 0.235004 hartree
zpe.thermalcorrener: 0.249054 hartree
zpe.thermalcorrenthalpy: 0.249998 hartree
zpe.thermalcorrgfe: 0.192607 hartree
zpe.sumelectzpe: -573.359119 hartree
zpe.sumelectthermal: -573.345070 hartree
zpe.sumelectthermalent: -573.344126 hartree
zpe.sumelectthermalfe: -573.401517 hartree
dipole: -3.1738 -0.2931 -0.4769
dipole: 3.2228
quadrupole: -79.1094 -88.1404 -71.3942
quadrupole: 5.7898 -1.8208 7.2457
quadrupole: 0.4386 -8.5924 8.1538 5.7898 -1.8208 7.2457
hfenergy: -573.5941234 hartree
pointgroup: C01 [X(C8H16N2O2)]
dipole: -1.2645261 0.0534344 -0.0760576 debye
polarizability: 127.073726|-9.75596|115.5305736|1.1286822|1.9367651|88.5638951 unknown
InChI: InChI=1S/C8H16N2O2/c1-3-4-5-6-10(9-12)7-8(2)11/h3-7H2,1-2H3
charge 0 multiplicity 1
28 atoms
O  1.89418 2.789621 -0.380817
O  3.061674 -1.779907 -0.691203
N  1.167512 -0.638256 -1.12397
N  1.778638 -1.842219 -0.805463
C  -1.071811 0.096902 -0.188237
C  -2.598078 0.035845 -0.425799
C  -0.301067 -0.686697 -1.274883
C  -3.404604 0.791782 0.654985
C  1.943937 0.584618 -1.404258
C  -4.927758 0.737171 0.409457
C  2.085925 1.558423 -0.210364
C  2.498704 0.953092 1.117824
H  -0.832381 -0.328498 0.806529
H  -0.748268 1.156667 -0.178894
H  -2.834923 0.464552 -1.422061
H  -2.928246 -1.023424 -0.453621
H  -0.568211 -0.293284 -2.276189
H  -0.574612 -1.756027 -1.24229
H  -3.173514 0.361329 1.650442
H  -3.070754 1.848555 0.686808
H  1.49175 1.126969 -2.251057
H  2.965921 0.239961 -1.674295
H  -5.482155 1.280631 1.195991
H  -5.189673 1.19285 -0.564024
H  -5.291717 -0.307522 0.400066
H  1.663433 0.359815 1.537312
H  3.338798 0.249111 0.975029
H  2.768301 1.745942 1.831785
