program: Gaussian 09
title: 000196342
version: EM64L-G09RevD.01
frameworkgroup: C1[X(C19H25FO2)]
method: RPBEPBE
basis: SDD
operation: Freq
keyword: #p
keyword: freq=noraman
keyword: PBEPBE/SDD
title: #p freq=noraman PBEPBE/SDD
converged: YES YES NO NO
title: Mulliken charges:
elementType: F O O C C C C C C C C C C C C C C C C C C C H H H H H H H H H H H H H H H H H H H H H H H H H
charge: -0.184597 -0.176524 -0.196575 -0.112682 -0.110439 -0.156118 0.312448 0.276686 -0.523823 -0.524249 -0.486859 -0.538438 0.342790 0.042569 -0.613784 -0.510777 -0.522894 -0.794854 -0.810336 -0.535655 -0.035742 0.090134 0.222444 0.219823 0.222814 0.223979 0.212741 0.217537 0.228522 0.227924 0.226369 0.235964 0.217485 0.230496 0.259848 0.250719 0.249039 0.219575 0.224633 0.230168 0.244071 0.230426 0.223998 0.228314 0.234935 0.238609 0.249284
chargesum: 0.00000
title: Mulliken charges with hydrogens summed into heavy atoms:
elementType: F O O C C C C C C C C C C C C C C C C C C C
charge: -0.184597 -0.176524 -0.196575 0.109762 0.109384 0.066696 0.312448 0.276686 -0.087102 -0.078191 -0.032566 -0.084989 0.342790 0.042569 -0.123439 -0.011019 -0.078687 -0.090189 -0.123089 -0.047762 -0.035742 0.090134
polarizability: 2.46276417e+02 -3.80487265e+00 1.87008855e+02 -1.43692109e+01 3.79084978e+00 1.69276013e+02
1716.lowfreq: -9.8972 -6.5805 -0.0003 0.0002 0.0009 8.4933 34.6227 50.4440 66.5157
frequency: 34.5805 50.3871 66.5111 85.4010 104.2932 132.3439 160.7182 171.0695 183.4938 207.4560 214.7522 237.5070 257.9030 271.8129 280.0263 290.5292 296.7182 310.0990 311.8659 334.9514 357.5995 371.0812 394.8385 414.1928 430.8336 454.0738 468.7678 483.9283 519.7903 534.6852 556.6141 565.3735 571.4770 577.5487 612.5234 647.7370 658.9570 697.5492 717.9611 771.0077 800.1661 821.3509 824.9467 836.5591 856.7213 888.8780 903.8444 917.6434 922.2058 941.1169 961.9611 980.8547 983.9546 994.8431 999.9531 1007.9708 1019.6904 1026.4834 1040.8500 1058.4460 1069.8215 1075.9056 1100.8752 1105.3645 1113.7958 1119.1780 1128.5643 1138.7977 1162.0331 1173.6839 1181.2866 1194.9238 1196.8631 1215.3745 1223.4771 1238.5521 1247.6201 1256.0085 1262.7199 1275.1256 1277.2578 1289.3589 1298.9316 1306.4903 1311.1942 1320.1515 1321.0303 1324.9527 1328.9673 1341.6166 1347.5177 1355.9762 1368.6487 1382.8279 1390.1524 1428.2670 1445.0410 1460.7197 1463.0775 1466.9945 1469.8986 1472.4035 1475.4756 1479.9406 1488.2977 1490.6928 1494.8081 1600.8612 1627.7390 1656.4296 2907.4976 2926.4080 2967.1244 2977.1885 2977.8014 2980.1703 2983.7872 2986.2561 2989.3002 2993.0871 2999.7141 3000.7979 3005.9229 3037.7219 3038.6434 3049.3922 3056.7742 3058.0637 3069.2268 3072.8609 3073.4086 3080.9272 3084.4780 3086.5341 3090.5976
redmass: 7.8667 3.6488 5.5604 8.2017 3.2053 3.9864 2.0938 2.1790 2.5041 1.5562 1.1146 2.7666 2.7244 2.5267 4.1490 3.7694 2.5061 4.0355 3.4654 4.0541 2.8144 2.4030 3.2289 3.7447 3.7647 3.7420 2.9887 3.5242 2.6576 2.3806 2.7984 3.1889 3.6636 3.4211 3.5695 3.3662 3.9539 3.0695 3.4364 2.8169 2.0777 1.8495 1.8654 2.1925 2.1540 2.3293 2.2919 2.1180 1.9513 1.9430 2.0142 2.2038 1.7677 1.9125 2.0307 2.1103 1.9494 2.3172 2.1192 3.0862 2.6905 2.2227 2.0475 1.9829 2.4242 1.7834 1.9188 1.9966 2.2217 1.9548 1.7753 1.7124 1.4567 1.7514 2.0393 1.7851 1.3952 1.7214 1.4196 1.9021 1.3452 1.4968 1.4199 2.6454 1.3744 1.3637 1.4085 1.3818 1.4201 1.4930 1.5152 1.4242 1.4454 1.1829 1.2017 1.0799 1.0814 1.0733 1.0838 1.0730 1.0774 1.0806 1.0853 1.0647 1.0646 1.0776 1.0670 11.2408 9.7703 12.0795 1.0809 1.0807 1.0668 1.0726 1.0682 1.0625 1.0422 1.0441 1.0525 1.0607 1.0609 1.0641 1.0658 1.0991 1.0991 1.1016 1.0963 1.0987 1.0949 1.1013 1.0997 1.0994 1.0974 1.0988 1.0986
irintensity: 3.9866 1.2742 2.6923 1.3717 2.0411 3.3569 0.6836 0.0222 0.3432 0.1118 0.0179 0.2636 0.1961 0.3660 1.7540 0.5304 2.1395 1.3849 0.4696 2.6314 0.5105 0.5995 0.4470 0.5157 2.9391 1.4719 1.1051 0.7307 0.5051 0.4759 2.7724 1.7604 9.5314 5.4549 0.6705 2.4451 3.4818 3.3688 0.0381 1.6263 0.2037 11.1111 6.6733 6.9280 8.7861 20.8227 4.7576 11.7997 1.9045 9.8535 9.5486 4.7044 20.3397 3.7808 23.6054 15.6777 34.0033 13.4000 18.5101 9.4868 9.5051 18.4244 26.2084 8.5694 14.7542 4.0634 12.0730 8.8815 4.5767 7.1034 7.2705 22.6846 1.5936 15.0876 14.1280 19.7548 1.4934 1.9278 2.4803 6.9121 3.8951 1.6345 2.5099 32.6211 1.3787 3.5832 0.9975 2.1796 2.6155 1.4006 0.8571 1.9804 2.2635 23.4877 21.3323 18.5773 15.6529 6.4087 5.0903 7.5915 12.2177 4.0503 18.9128 14.8231 9.1037 9.2148 4.1973 302.7665 39.5159 187.7985 11.5907 14.6924 17.5043 12.1321 9.1559 28.4086 14.4216 4.4579 8.5727 77.8049 46.0701 4.5195 11.5484 4.9316 67.0191 48.5502 24.6112 10.1034 17.3784 18.8609 51.3340 17.0976 16.1629 31.6926 27.0362
temp: 298.150 k
press: 1.00000 atm
elementType: 9 8 8 6 6 6 6 6 6 6 6 6 6 6 6 6 6 6 6 6 6 6 1 1 1 1 1 1 1 1 1 1 1 1 1 1 1 1 1 1 1 1 1 1 1 1 1
symmnumber: 1
zpe: 1047072.0 jmol-1
zpe.correction: 0.398809 hartree
zpe.thermalcorrener: 0.418899 hartree
zpe.thermalcorrenthalpy: 0.419844 hartree
zpe.thermalcorrgfe: 0.351792 hartree
zpe.sumelectzpe: -987.633707 hartree
zpe.sumelectthermal: -987.613617 hartree
zpe.sumelectthermalent: -987.612672 hartree
zpe.sumelectthermalfe: -987.680724 hartree
dipole: -3.2202 0.1528 4.2001
dipole: 5.2947
quadrupole: -181.2397 -127.7898 -133.4763
quadrupole: -18.0132 4.8339 -1.7904
quadrupole: -33.7377 19.7121 14.0256 -18.0132 4.8339 -1.7904
hfenergy: -988.0325161 hartree
pointgroup: C01 [X(C19H25F1O2)]
dipole: 1.2594382 0.0644528 -1.6580094 debye
polarizability: 246.1596677|3.7160285|187.0243403|-14.7153459|-3.6979275|169.3772781 unknown
InChI: InChI=1S/C19H25FO2/c1-18-10-8-15(21)17(20)14(18)4-3-11-12-5-6-16(22)19(12,2)9-7-13(11)18/h11-13H,3-10H2,1-2H3
charge 0 multiplicity 1
47 atoms
F  -3.932078 1.96916 0.492876
O  4.963684 -0.955455 1.313103
O  -4.892294 -0.291867 1.774762
C  0.689417 0.717981 -0.554947
C  -0.105535 -0.57529 -0.145426
C  1.995866 0.743722 0.263535
C  2.886893 -0.508837 0.000796
C  -1.511471 -0.655704 -0.88398
C  0.757742 -1.863076 -0.298969
C  2.125507 -1.776293 0.434815
C  -0.147727 2.00367 -0.346499
C  2.983372 1.938171 0.159632
C  -2.217027 0.670777 -0.567584
C  4.149751 -0.147545 0.806933
C  -1.536963 1.930111 -1.049022
C  4.250778 1.393948 0.882599
C  -2.389366 -1.854302 -0.411469
C  3.380226 -0.634974 -1.476906
C  -1.339357 -0.810478 -2.42629
C  -3.020007 -1.67531 0.983043
C  -3.309393 0.720152 0.254716
C  -3.863342 -0.402056 1.0521
H  0.950609 0.65592 -1.631736
H  -0.328985 -0.46201 0.940461
H  1.695088 0.686624 1.336749
H  0.925961 -2.074714 -1.372501
H  0.205878 -2.732258 0.105239
H  1.95729 -1.743641 1.530007
H  2.72361 -2.684326 0.232161
H  0.407346 2.881156 -0.72937
H  -0.307784 2.169057 0.738759
H  2.594331 2.852873 0.638552
H  3.203069 2.18638 -0.895901
H  -1.393796 1.909743 -2.146054
H  -2.136517 2.821908 -0.805354
H  4.266105 1.681155 1.951862
H  5.208699 1.738461 0.453085
H  -1.79886 -2.786751 -0.444223
H  -3.208619 -1.980358 -1.147206
H  3.919791 0.265983 -1.819292
H  4.071886 -1.492745 -1.556204
H  2.54242 -0.80651 -2.173718
H  -0.612142 -0.102678 -2.857069
H  -0.998154 -1.833198 -2.668842
H  -2.306903 -0.653045 -2.936748
H  -2.237375 -1.605284 1.766453
H  -3.664022 -2.531145 1.250268
