program: Gaussian 09
title: 000196535
version: EM64L-G09RevD.01
frameworkgroup: C1[X(C13H23N2O15P3)]
method: RPBEPBE
basis: SDD
operation: Freq
keyword: #p
keyword: freq=noraman
keyword: PBEPBE/SDD
title: #p freq=noraman PBEPBE/SDD
converged: NO YES NO NO
title: Mulliken charges:
elementType: P P P O O O O O O O O O O O O O O O N N C C C C C C C C C C C C C H H H H H H H H H H H H H H H H H H H H H H H
charge: 1.453966 1.486718 1.481569 -0.285759 -0.441367 -0.436572 -0.484619 -0.232868 -0.734771 -0.372225 -0.627193 -0.657044 -0.743922 -0.785923 -0.520230 -0.667787 -0.646689 -0.705054 -0.199187 -0.369808 -0.208818 -0.185731 -0.044463 -0.046727 -0.350731 -0.227061 0.220836 0.244931 -0.468536 0.136124 -0.354080 -0.360428 -0.695941 0.291506 0.255459 0.284728 0.295175 0.257852 0.298929 0.388373 0.327786 0.351144 0.234498 0.256193 0.372877 0.219185 0.193588 0.209896 0.192143 0.220899 0.211628 0.206294 0.420195 0.456560 0.431898 0.452582
chargesum: 0.00000
title: Mulliken charges with hydrogens summed into heavy atoms:
elementType: P P P O O O O O O O O O O O O O O O N N C C C C C C C C C C C C C
charge: 1.453966 1.486718 1.481569 -0.285759 -0.052994 -0.085429 -0.484619 -0.232868 -0.734771 -0.372225 -0.206998 -0.657044 -0.743922 -0.329363 -0.520230 -0.235889 -0.194107 -0.705054 -0.199187 0.003070 0.082688 0.069728 0.240265 0.248448 0.206050 0.100725 0.220836 0.244931 0.022155 0.136124 0.058693 0.041611 -0.057120
polarizability: 3.20748365e+02 1.89260332e+01 2.80267498e+02 -1.28222358e+01 1.75983719e+01 2.23880974e+02
1716.lowfreq: -11.7928 -7.2943 0.0007 0.0009 0.0017 2.8431 18.3359 26.1350 29.2432
frequency: 12.6854 26.0335 29.1856 36.1191 42.6987 58.6329 60.7140 65.9757 70.5271 77.4673 88.1651 97.7070 108.0028 122.6822 124.7348 133.7517 139.9431 147.1574 158.0855 164.6357 169.0870 175.4110 189.5347 198.3043 211.8741 215.2861 219.2784 226.6458 237.1230 245.4686 260.0303 262.3751 269.3760 282.1078 287.0020 297.9820 304.7943 320.4002 328.9776 332.9772 339.0603 349.4579 364.8157 368.9125 381.6928 390.5654 408.4643 412.9296 416.1791 422.5073 433.0040 445.6988 472.1612 514.5636 524.8748 541.9021 550.7168 585.2918 628.9680 656.4585 674.8334 685.4095 693.2988 698.2864 702.2962 718.1265 722.0195 733.4725 746.7642 757.7474 759.8581 766.8880 774.1743 785.3030 789.5806 794.4748 810.0495 827.2010 853.8219 892.2236 897.7598 900.1263 917.8305 925.4295 941.7132 945.8761 983.0605 987.6507 995.2488 1005.4169 1023.8024 1029.7516 1037.6983 1041.6030 1045.0191 1061.2831 1075.1935 1092.8154 1094.1879 1101.0653 1106.2930 1115.2956 1172.6981 1180.2019 1183.2881 1189.5231 1201.1477 1219.2130 1230.9148 1239.1066 1248.2360 1263.0745 1264.3745 1280.5960 1280.9004 1296.3180 1297.3171 1299.1875 1307.0831 1314.9228 1320.9924 1340.4483 1350.2312 1358.0258 1369.1443 1382.8405 1388.5717 1391.1888 1411.9284 1445.5078 1460.9686 1464.2906 1469.4018 1475.5766 1477.3640 1488.0979 1502.9801 1605.6774 1663.1710 1885.5131 2834.6123 2958.4439 2969.9330 2973.5125 2976.8447 2989.8285 3003.9413 3013.4623 3020.5113 3039.6365 3049.3260 3064.5878 3069.3950 3075.7675 3079.6748 3086.0536 3189.0489 3207.4727 3242.9688 3516.9018 3567.7802 3592.9157
redmass: 12.0713 6.1714 4.6385 7.7081 9.1159 6.0565 7.4608 3.5598 2.2218 4.5730 7.1679 5.5694 5.3872 2.7243 5.8529 6.4667 5.3923 3.4584 3.1200 7.4759 3.9991 6.8271 8.6504 7.5631 5.8951 5.6660 2.3664 2.1596 3.9615 7.8462 6.3725 3.0889 5.7144 6.1640 6.7555 7.1418 4.6558 5.4758 2.5647 9.5707 1.9105 6.9489 7.7489 9.9984 8.9952 6.7888 5.0640 4.2728 7.1306 4.1491 11.0466 6.2165 4.9013 14.9544 5.5113 5.3544 8.4212 6.2772 4.9258 1.2564 4.7686 9.8117 3.4199 2.4911 1.5295 5.7904 2.9114 1.5747 2.6222 6.0201 6.0757 6.4681 1.9019 7.7436 2.9002 2.2470 4.0246 3.4300 1.2744 2.2880 2.4892 1.8953 10.0959 2.0975 2.4079 1.6029 2.4949 5.0755 1.3071 6.1806 4.2060 3.6392 1.9903 3.2738 1.7886 4.0310 2.6659 2.9385 10.5937 2.5730 2.1756 1.5265 3.2648 1.2580 1.6037 4.4406 1.2282 1.3662 1.3008 1.1874 1.4871 1.3471 1.2749 1.2088 1.4094 1.1549 1.2691 1.6055 1.3337 1.4602 1.2654 1.5177 2.2207 1.1810 1.6405 1.1827 1.3963 1.2196 1.3149 2.8379 1.2907 1.0858 1.0617 1.0605 1.0514 1.0898 2.4243 5.3762 8.1178 1.3381 1.0716 1.0594 1.0605 1.0361 1.0634 1.0591 1.0950 1.0864 1.0992 1.1028 1.0861 1.0940 1.1009 1.0992 1.1010 1.0883 1.0734 1.0931 1.0664 1.0773 1.0663 1.0669
irintensity: 3.7670 0.4212 0.0607 0.7618 0.4581 1.0102 3.1424 1.0214 0.5874 6.4635 0.3915 2.8634 4.3877 1.3711 2.5346 4.6207 2.6679 18.4982 29.4031 1.7992 24.9696 11.8900 7.5391 13.3498 0.9469 8.2620 17.8822 8.1657 4.1487 9.8080 3.4759 39.7644 12.9262 59.3854 69.0270 3.3716 6.2523 97.7158 66.9991 8.0058 155.3168 69.2766 16.0257 70.9210 10.4186 22.6110 11.9738 32.7812 14.1540 17.6833 11.3280 25.8857 6.1230 72.5024 20.8601 13.4545 41.3532 4.7970 4.1363 58.8266 8.1225 95.3578 98.2733 19.3734 70.5423 273.8741 55.7096 57.6555 17.5478 48.6705 132.7263 323.7405 46.4694 59.1243 31.8984 53.7866 8.9749 29.9052 383.7688 22.2507 92.0180 16.2897 315.6622 1.6608 78.5077 20.8013 32.0867 114.8719 99.6313 60.9865 15.0027 181.3667 26.4202 36.1283 68.0798 30.2708 4.4159 26.2236 253.1562 14.5246 7.8475 3.5738 18.4671 74.2013 1.3407 6.7935 65.2853 1.3203 29.2488 12.7229 150.6515 57.8975 44.4517 4.3909 4.6032 75.5622 106.4272 69.0625 509.3716 20.0490 1.2452 33.9047 30.7335 6.5490 5.1339 230.0154 1.9673 15.6641 3.8140 114.5789 26.7426 7.5999 5.7897 4.3135 7.9459 11.2123 699.9137 73.1141 689.3156 1933.6590 575.9509 7.9167 20.8001 30.8534 33.0939 17.7754 1.3553 23.6614 1.4652 37.9296 8.2841 4.1920 83.2012 50.0773 9.0240 57.0968 611.6549 9.3447 187.5553 89.5016 16.2649 139.0375
temp: 298.150 k
press: 1.00000 atm
elementType: 15 15 15 8 8 8 8 8 8 8 8 8 8 8 8 8 8 8 7 7 6 6 6 6 6 6 6 6 6 6 6 6 6 1 1 1 1 1 1 1 1 1 1 1 1 1 1 1 1 1 1 1 1 1 1 1
symmnumber: 1
zpe: 1039314.1 jmol-1
zpe.correction: 0.395854 hartree
zpe.thermalcorrener: 0.431984 hartree
zpe.thermalcorrenthalpy: 0.432928 hartree
zpe.thermalcorrgfe: 0.327223 hartree
zpe.sumelectzpe: -2768.172185 hartree
zpe.sumelectthermal: -2768.136055 hartree
zpe.sumelectthermalent: -2768.135110 hartree
zpe.sumelectthermalfe: -2768.240815 hartree
dipole: 1.0042 4.4821 2.5572
dipole: 5.2571
quadrupole: -221.4745 -221.9903 -227.0437
quadrupole: -5.4992 -8.7865 -17.2770
quadrupole: 2.0284 1.5125 -3.5409 -5.4992 -8.7865 -17.2770
hfenergy: -2768.5680388 hartree
pointgroup: C01[X(C13H23N2O15P3)]
dipole: -0.4748498 1.4041427 -1.4424802 debye
polarizability: 300.4121056|-37.3518491|274.775538|-26.8962168|-20.9265866|249.7091936 unknown
InChI: InChI=1S/C13H23N2O15P3/c1-2-3-4-7-5-15(13(19)14-11(7)18)12-10(17)9(16)8(28-12)6-27-32(23,24)30-33(25,26)29-31(20,21)22/h5,8-10,12,14,16-17,20-21,23,25H,2-4,6H2,1H3
charge 0 multiplicity 1
56 atoms
P  2.651437 1.802209 -1.480921
P  3.523172 -0.642605 0.286122
P  1.278406 -0.809058 2.468616
O  -1.818198 1.561514 -1.231572
O  -2.039722 1.66033 2.07252
O  -2.997204 4.313741 -0.385413
O  1.03398 2.26044 -1.650936
O  -4.668248 -0.009416 1.468941
O  2.67204 0.110145 -1.080292
O  -1.406303 -3.168052 2.470021
O  3.074269 1.8707 -3.113618
O  3.550246 2.592822 -0.409654
O  2.281552 -1.446531 1.112675
O  3.77022 0.688511 1.354108
O  4.743438 -1.508007 -0.193475
O  0.750348 -2.182158 3.178644
O  2.433192 -0.192127 3.535162
O  0.250401 0.254105 1.857711
N  -2.747044 -0.185767 0.112883
N  -3.115948 -1.734848 1.843048
C  -2.740425 2.204818 0.936507
C  -2.0353 3.434586 0.289353
C  -2.895483 1.242674 -0.298046
C  -1.162662 2.844059 -0.837358
C  0.280351 2.618138 -0.396568
C  -1.731029 -0.990544 -0.381055
C  -3.608185 -0.60541 1.157013
C  -1.336506 -2.157439 0.251847
C  -0.248996 -3.079907 -0.268535
C  -1.929912 -2.411584 1.549601
C  0.342174 -2.688666 -1.638755
C  1.421678 -3.68971 -2.108824
C  2.050178 -3.290325 -3.460659
H  -3.734455 2.476854 1.323351
H  -1.455057 3.974898 1.062525
H  -3.871895 1.385749 -0.79148
H  -1.192215 3.499785 -1.723803
H  0.711314 3.55396 0.003627
H  0.373754 1.798635 0.339737
H  -1.175176 1.170238 1.89148
H  -1.228023 -0.603081 -1.266941
H  -3.606839 4.712112 0.286231
H  -0.661637 -4.108241 -0.31883
H  0.578177 -3.131691 0.465397
H  -3.584473 -1.960803 2.727496
H  0.798123 -1.680037 -1.578699
H  -0.462869 -2.635133 -2.401526
H  2.216166 -3.756293 -1.338514
H  0.97672 -4.70267 -2.187834
H  2.827393 -4.011887 -3.77106
H  2.522749 -2.292444 -3.391608
H  1.286684 -3.248289 -4.260583
H  3.944485 1.461522 -3.355724
H  3.892242 1.591825 0.864625
H  -0.16594 -2.711043 2.869761
H  3.117355 0.366195 3.040785
