program: Gaussian 09
title: 000188041
version: EM64L-G09RevD.01
frameworkgroup: C1[X(C10H7ClO)]
method: RPBEPBE
basis: SDD
operation: Freq
keyword: #p
keyword: freq=noraman
keyword: PBEPBE/SDD
title: #p freq=noraman PBEPBE/SDD
converged: NO NO NO NO
title: Mulliken charges:
elementType: Cl O C C C C C C C C C C H H H H H H H
charge: -0.022738 -0.414948 0.304974 0.448609 0.204816 -0.271743 -0.466250 -0.443749 -0.429829 -0.217324 -0.239803 -0.233252 0.241801 0.243038 0.216409 0.230034 0.256545 0.234260 0.359150
chargesum: 0.00000
title: Mulliken charges with hydrogens summed into heavy atoms:
elementType: Cl O C C C C C C C C C C
charge: -0.022738 -0.055798 0.304974 0.448609 0.204816 -0.271743 -0.224448 -0.200711 -0.213420 0.012709 0.016742 0.001008
polarizability: 1.62985343e+02 -7.43620972e+00 1.55074345e+02 5.59735811e-03 1.36834931e-03 4.58507375e+01
1716.lowfreq: -11.1553 -6.9513 -0.0008 0.0009 0.0012 3.4573 55.9737 154.1155 217.0802
frequency: 55.9490 154.1138 217.0775 224.3598 249.3446 299.4358 366.9567 376.9573 464.5848 470.1805 478.8363 496.0321 523.0293 582.5293 600.7676 627.8205 751.9306 752.2505 765.9355 775.2247 820.3670 861.6810 908.3767 910.1157 962.7766 981.0634 1011.2885 1080.7571 1091.4467 1153.4610 1168.8946 1189.1751 1201.6081 1234.2631 1273.6343 1371.4852 1391.1724 1399.0377 1427.5838 1456.8922 1521.8919 1577.5855 1597.2598 1628.0099 3111.6735 3132.3554 3137.3451 3152.4789 3163.0595 3171.1075 3566.1084
redmass: 8.2974 4.2572 12.8183 4.3004 3.7404 7.7863 1.1432 7.7688 4.8534 3.3544 4.3229 6.4905 7.0510 6.2305 4.0552 3.1838 1.5378 6.6117 1.5277 5.5684 2.1915 1.4353 1.4453 6.0722 1.3257 1.3667 4.2330 2.1422 2.0919 1.4166 1.1723 1.4024 1.5566 1.8201 2.3281 2.7904 4.5799 3.4074 2.2570 2.5794 4.3010 7.3486 5.8996 7.1102 1.0893 1.0872 1.0882 1.0931 1.0995 1.0987 1.0657
irintensity: 0.0383 3.1467 1.8135 8.5573 11.8827 5.1221 117.8052 8.8869 1.0996 0.0672 0.0468 6.4505 1.3165 3.6898 1.0838 0.1752 67.4633 12.3543 25.9251 2.9730 74.5259 6.0730 2.3236 85.5131 0.4107 2.8648 61.0921 4.3837 1.9884 34.9104 29.9539 53.3893 6.7459 42.2094 52.3795 29.8961 3.1885 14.3871 14.7017 0.6559 0.7175 127.6168 0.3552 16.6403 16.8069 1.9655 4.9669 16.1812 26.4897 11.2000 33.5242
temp: 298.150 k
press: 1.00000 atm
elementType: 17 8 6 6 6 6 6 6 6 6 6 6 1 1 1 1 1 1 1
symmnumber: 1
zpe: 364186.8 jmol-1
zpe.correction: 0.138711 hartree
zpe.thermalcorrener: 0.148214 hartree
zpe.thermalcorrenthalpy: 0.149158 hartree
zpe.thermalcorrgfe: 0.103559 hartree
zpe.sumelectzpe: -919.715811 hartree
zpe.sumelectthermal: -919.706308 hartree
zpe.sumelectthermalent: -919.705364 hartree
zpe.sumelectthermalfe: -919.750963 hartree
dipole: 2.6780 0.1826 0.0001
dipole: 2.6842
quadrupole: -70.3242 -59.8948 -81.3020
quadrupole: -7.0819 0.0004 0.0004
quadrupole: 0.1828 10.6122 -10.7950 -7.0819 0.0004 0.0004
hfenergy: -919.8545224 hartree
pointgroup: C01 [X(C10H7Cl1O1)]
dipole: 0.8306131 0.6521728 0.0000269 debye
dipolederiv: -0.1409329 -0.1961688 -0.0000069 -0.2234661 -0.7267344 -0.0000151 -0.0000032 -0.0000013 -0.0502236 -0.063022 0.0504975 0.000002 0.2306685 -1.3281494 -0.000054 0.0000132 -0.000054 -0.3839727 0.026432 0.1407536 0.000008 -0.1673243 -0.4293509 -0.0000194 -0.0000154 -0.0000074 0.0186879 0.2643127 -0.0419798 0.0000095 0.0969467 -0.0121543 -0.0000017 0.0000159 -0.0000068 0.0818671 0.1247657 0.0774772 0.000007 -0.270995 1.2547869 0.0000707 -0.0000125 0.00008 0.0691337 0.1637045 0.0700801 0.0000045 0.4040539 1.0778731 0.0000185 0.0000112 -0.000006 -0.0660827 -0.2996689 0.0424041 -0.0000005 0.0473099 -0.0047467 0.0000125 0.0000011 0.0000102 -0.2215002 -0.1935572 -0.0045337 0.000001 -0.0025126 0.0722448 0.0000162 0.0000007 0.0000203 -0.1878686 -0.0470861 -0.3949032 -0.0000186 0.1226446 -0.2703922 0. 0.0000068 -0.0000158 -0.2212751 0.1496992 0.0771873 0.0000152 -0.1594593 0.2320018 0.0000143 0.0000088 0.0000256 -0.1300359 -0.0557401 0.1744416 0.0000067 -0.0909451 -0.3339416 -0.0000018 -0.0000018 0.00001 -0.1278362 0.1176205 -0.0354061 0.0000075 0.0304917 0.1692689 0.0000127 0.0000146 0.0000045 -0.1507797 0.0698076 0.0292157 -0.0000021 -0.0353242 -0.1015061 -0.0000152 -0.0000073 -0.0000137 0.1684228 0.0740059 -0.0629804 -0.0000067 0.0065643 -0.0964431 -0.0000126 -0.0000044 -0.0000164 0.1609104 -0.0409109 0.0917297 -0.000001 0.1341675 -0.0292504 -0.0000083 0.0000036 -0.0000115 0.1747025 -0.0875378 -0.0921768 -0.0000145 -0.0814556 0.0534652 -0.0000091 -0.0000156 -0.0000094 0.1602833 -0.0256269 -0.0559676 -0.0000075 -0.069218 0.0639848 -0.000006 -0.0000041 -0.0000015 0.164714 -0.0549688 0.1011931 -0.0000041 0.0922003 0.0108555 -0.0000017 -0.0000068 -0.000004 0.1624317 0.0187034 0.0291363 0.0000003 -0.0643473 0.3981881 0. -0.0000048 -0.0000029 0.3784213 unknown
polarizability: 167.3987478|0.9511263|150.6609404|0.0038576|0.0042804|45.8507375 unknown
InChI: InChI=1S/C10H7ClO/c11-8-5-1-3-7-4-2-6-9(12)10(7)8/h1-6,12H
charge 0 multiplicity 1
19 atoms
Cl -1.69077 -2.607259 -0.000106
O  1.158107 -2.421146 -0.000118
C  -0.00866 -0.274372 -0.000025
C  0.104094 1.181283 0.00005
C  1.228697 -1.023276 -0.000027
C  -1.342809 -0.820193 -0.000091
C  1.393638 1.810277 0.00013
C  -1.076756 1.99448 0.000037
C  2.472511 -0.375189 0.000052
C  2.557815 1.045209 0.000132
C  -2.475849 -0.002171 -0.000097
C  -2.34415 1.416352 -0.000036
H  1.441464 2.90447 0.000189
H  -0.958846 3.083781 0.000098
H  3.392976 -0.974337 0.000044
H  3.542521 1.523703 0.000197
H  -3.468706 -0.461733 -0.000139
H  -3.246549 2.036196 -0.000046
H  2.069274 -2.808877 -0.000143
