program: Gaussian 09
title: 000017301
version: EM64L-G09RevD.01
frameworkgroup: C1[X(C14H12O)]
method: RPBEPBE
basis: SDD
operation: Freq
keyword: #pfreq=noraman
keyword: PBEPBE/SDD
title: #p freq=noraman PBEPBE/SDD
converged: NO NO NO NO
title: Mulliken charges:
elementType: O C C C C C C C C C C C C C C H H H H H H H H H H H H
charge: -0.264044 -0.697063 0.314836 0.172675 0.272462 0.187731 -0.578916 -0.374192 -0.423454 -0.401024 0.330695 -0.365800 -0.240592 -0.233903 -0.536654 0.242827 0.242827 0.253321 0.240187 0.238868 0.236962 0.249414 0.223584 0.223706 0.220069 0.245410 0.220070
chargesum: 0.00000
title: Mulliken charges with hydrogens summed into heavy atoms:
elementType: O C C C C C C C C C C C C C C
charge: -0.264044 -0.211410 0.314836 0.172675 0.272462 0.187731 -0.325594 -0.134005 -0.184586 -0.164062 0.330695 -0.116386 -0.017009 -0.010197 0.148894
polarizability: 2.60761512e+02 4.41111387e-01 1.53901073e+02 -9.92367905e-04 5.81050599e-04 6.82285811e+01
1716.lowfreq: -3.9790 0.0002 0.0005 0.0007 3.6061 11.6797 57.1513 101.0920 144.4472
frequency: 57.1213 101.0769 144.4464 149.9825 188.6858 231.2813 237.8314 251.3106 344.1679 372.0589 422.7278 436.4110 439.0478 505.9991 512.6772 537.3570 571.0495 588.6983 639.3018 701.2974 706.2401 739.8482 745.7257 775.5472 819.4256 830.3720 848.4119 870.2769 900.5987 931.0685 955.5058 965.3654 983.5015 986.8132 1006.0141 1025.4988 1091.7204 1111.8386 1114.6817 1130.0606 1146.9487 1158.4609 1168.1772 1185.0150 1199.7208 1217.4263 1268.3295 1288.2684 1307.8679 1375.6694 1390.1149 1424.5469 1430.2556 1444.7096 1455.8847 1463.2255 1466.7396 1474.9873 1489.7467 1590.4862 1591.4528 1620.6174 1623.0278 2952.6788 2981.7631 3027.4184 3037.0480 3118.1417 3120.1584 3125.3102 3133.4374 3139.6814 3144.4742 3158.8447 3168.1036
redmass: 3.8639 3.9791 3.6969 4.0659 2.2157 3.8332 2.1722 1.4555 4.4375 6.3663 2.7153 2.8323 4.3451 3.2860 3.8947 5.9778 5.9614 3.0090 6.4763 5.4480 3.0345 1.6362 5.6401 2.0704 4.5796 1.4698 1.4894 1.3525 4.1752 1.6315 1.4111 1.7949 1.3262 5.8953 4.8054 2.1657 2.1327 1.6604 1.2608 1.1480 1.4210 1.4457 1.1427 1.7066 1.8573 2.3448 2.4523 1.5484 2.0692 7.3199 3.7950 1.2374 1.4749 2.7494 2.0559 2.4490 1.0494 1.1668 3.1833 6.5490 8.0215 7.3070 7.1023 1.0336 1.0604 1.0996 1.1035 1.0855 1.0987 1.0892 1.0894 1.0944 1.0910 1.1002 1.0954
irintensity: 1.6894 2.7944 1.5617 1.3157 1.0297 1.7200 12.9415 0.2271 0.5069 4.5481 9.8905 0.0001 4.0872 0.1129 3.5555 6.2194 14.3311 1.8504 1.6549 3.3403 0.0013 54.9046 1.8101 56.0305 0.1782 25.2475 22.0347 3.4196 7.1647 1.8034 1.9587 10.5574 0.1072 22.1091 20.6456 16.2686 18.3689 26.6736 0.2465 0.0096 29.7483 16.6410 1.3937 1.6404 12.7858 77.9520 119.2449 0.4514 37.8697 5.8722 4.3635 24.5165 39.1373 23.8379 29.2752 61.0123 13.2722 31.7846 24.2392 1.3861 8.4870 2.2057 112.0870 75.4490 16.7254 8.2697 52.3557 5.3415 29.5994 5.5250 6.9555 35.5585 11.6204 39.8888 10.3078
temp: 298.150 k
press: 1.00000 atm
elementType: 8 6 6 6 6 6 6 6 6 6 6 6 6 6 6 1 1 1 1 1 1 1 1 1 1 1 1
symmnumber: 1
zpe: 567387.5 jmol-1
zpe.correction: 0.216106 hartree
zpe.thermalcorrener: 0.227947 hartree
zpe.thermalcorrenthalpy: 0.228891 hartree
zpe.thermalcorrgfe: 0.178328 hartree
zpe.sumelectzpe: -614.876612 hartree
zpe.sumelectthermal: -614.864772 hartree
zpe.sumelectthermalent: -614.863828 hartree
zpe.sumelectthermalfe: -614.914391 hartree
dipole: -0.8147 -2.1399 0.0000
dipole: 2.2897
quadrupole: -76.4459 -75.6269 -93.1053
quadrupole: 7.8460 -0.0002 0.0001
quadrupole: 5.2801 6.0991 -11.3793 7.8460 -0.0002 0.0001
hfenergy: -615.0927189 hartree
pointgroup: C01 [X(C14H12O1)]
dipole: 0.3026487 -0.8484811 0.0000088 debye
polarizability: 260.6951134|-2.6991744|153.9674717|-0.0010044|-0.0005599|68.2285811 unknown
InChI: InChI=1S/C14H12O/c1-15-12-6-7-14-11(9-12)8-10-4-2-3-5-13(10)14/h2-7,9H,8H2,1H3
charge 0 multiplicity 1
27 atoms
O  4.184168 0.225176 0.000071
C  -0.534656 -1.788341 0.00005
C  0.561559 -0.726174 0.00004
C  -0.021565 0.574739 0.000025
C  -1.814628 -0.956069 0.000055
C  -1.48952 0.435989 0.000036
C  1.956995 -0.902983 0.000061
C  0.811133 1.719272 0.000031
C  -3.154933 -1.377853 0.000091
C  -2.514528 1.408831 0.000053
C  2.780838 0.254803 0.000058
C  2.208996 1.555884 0.000046
C  -4.183602 -0.400423 0.000111
C  -3.862791 0.980012 0.000093
C  4.835209 -1.082265 0.000062
H  -0.471617 -2.445559 0.889571
H  -0.471627 -2.445549 -0.889481
H  2.389331 -1.908823 0.00009
H  0.384665 2.728584 0.000023
H  -3.408988 -2.444613 0.000103
H  -2.276021 2.478698 0.000035
H  2.884136 2.41702 0.000048
H  -5.233799 -0.713698 0.000141
H  -4.669298 1.722243 0.000109
H  4.57219 -1.667003 0.904127
H  5.9148 -0.87039 0.000041
H  4.572155 -1.667008 -0.90399
