program: Gaussian 09
title: 000188034
version: EM64L-G09RevD.01
frameworkgroup: C1[X(C13H10ClNOS)]
method: RPBEPBE
basis: SDD
operation: Freq
keyword: #p
keyword: freq=noraman
keyword: PBEPBE/SDD
title: #p freq=noraman PBEPBE/SDD
converged: YES YES NO NO
title: Mulliken charges:
elementType: Cl S O N C C C C C C C C C C C C C H H H H H H H H H H
charge: -0.054252 0.110716 -0.187158 -0.413828 0.475003 -0.146676 -0.432176 -0.338884 -0.155690 -0.237122 -0.195563 -0.212070 -0.250975 -0.046221 -0.210989 -0.196370 -0.093243 0.223423 0.296242 0.328162 0.269300 0.256866 0.230174 0.230139 0.232366 0.259408 0.259419
chargesum: 0.00000
title: Mulliken charges with hydrogens summed into heavy atoms:
elementType: Cl S O N C C C C C C C C C C C C C
charge: -0.054252 0.110716 -0.187158 -0.085666 0.475003 -0.146676 -0.208753 -0.042642 0.113610 0.019744 0.034611 0.018069 -0.018610 -0.046221 0.048419 0.063049 -0.093243
polarizability: 3.16049477e+02 7.49565484e+00 1.61598011e+02 5.66249696e+00 -1.13222527e+01 8.94801836e+01
1716.lowfreq: -7.1783 -3.7097 -0.0032 -0.0026 0.0002 8.4479 14.9642 24.3854 41.3470
frequency: 14.3882 24.2931 41.3270 61.6676 73.2491 102.7661 142.6159 191.4247 223.9990 240.7732 292.7447 321.0752 334.5240 341.2300 406.6372 408.2542 438.2651 489.5322 502.1130 509.8111 564.4331 608.5089 614.2627 619.5344 633.6736 695.5232 696.2140 716.1282 767.4990 776.7840 817.2643 820.5667 841.6895 844.6288 916.8861 944.3860 958.8908 974.0739 985.1619 990.0669 998.2337 1026.4165 1067.7305 1071.1956 1088.3119 1103.2676 1117.2993 1174.5636 1181.9855 1191.9576 1251.4070 1285.9566 1322.2996 1362.9034 1380.9608 1383.2757 1430.4544 1456.6822 1484.7146 1510.7901 1576.0819 1580.2195 1603.5655 1614.5716 1674.3919 3114.6049 3136.0476 3148.1042 3154.6887 3165.8642 3168.2069 3177.1402 3186.4533 3193.7915 3512.5366
redmass: 6.4886 4.8366 6.0721 8.0319 5.3368 8.1263 7.5977 10.3014 9.0802 4.0083 7.3724 5.1144 13.7716 7.9440 2.9040 2.8969 8.1169 4.0600 2.9472 6.4006 7.6921 8.8593 6.4672 6.8435 1.2394 2.3046 3.2083 7.3064 1.6533 7.2368 1.3508 1.3575 1.3119 5.0730 1.4270 1.3352 1.3730 1.3608 6.1593 5.8259 1.3104 2.2851 7.3187 1.8953 1.7025 1.3600 3.2382 1.0502 1.1197 1.1130 2.3218 1.2353 1.4126 4.8261 4.0813 6.1328 2.2498 2.1846 2.3276 1.8458 6.3501 7.9366 5.1703 5.9916 8.1470 1.0888 1.0869 1.0935 1.0892 1.0893 1.0997 1.0970 1.0975 1.0953 1.0765
irintensity: 1.0850 0.3197 0.3060 1.4144 3.0195 0.2485 1.9347 2.2152 12.0852 3.5299 1.5817 0.1613 2.1283 3.6945 0.0101 0.1148 31.6711 27.8806 30.0631 0.7850 53.3919 0.4300 0.7079 0.4053 47.0020 32.9406 13.7931 4.7397 101.5710 83.2901 23.4233 36.2162 4.6737 80.2187 13.1319 0.1812 0.4868 0.0853 0.7111 101.7498 1.7777 1.0276 13.0879 95.9053 50.1429 8.1726 156.2142 0.4282 1.7598 3.1064 104.9147 0.8292 74.1870 0.7638 12.3803 79.7892 136.0786 102.1828 90.9470 378.4526 17.3445 2.0975 39.0403 65.5688 142.4758 12.6544 0.1574 26.4858 1.7450 1.5458 26.1801 3.9858 0.6961 3.3999 25.2630
temp: 298.150 k
press: 1.00000 atm
elementType: 17 16 8 7 6 6 6 6 6 6 6 6 6 6 6 6 6 1 1 1 1 1 1 1 1 1 1
symmnumber: 1
zpe: 513458.4 jmol-1
zpe.correction: 0.195566 hartree
zpe.thermalcorrener: 0.210937 hartree
zpe.thermalcorrenthalpy: 0.211881 hartree
zpe.thermalcorrgfe: 0.149284 hartree
zpe.sumelectzpe: -1488.304737 hartree
zpe.sumelectthermal: -1488.289365 hartree
zpe.sumelectthermalent: -1488.288421 hartree
zpe.sumelectthermalfe: -1488.351019 hartree
dipole: 3.2845 2.0466 -0.2135
dipole: 3.8758
quadrupole: -104.8339 -105.4938 -114.2051
quadrupole: -0.0636 0.1038 -5.1928
quadrupole: 3.3437 2.6838 -6.0275 -0.0636 0.1038 -5.1928
hfenergy: -1488.5003025 hartree
pointgroup: C01 [X(C13H10Cl1N1O1S1)]
dipole: -1.2776205 -0.7677474 -0.3217062 debye
polarizability: 315.2551524|14.0214241|147.4318272|-7.3271304|30.9062241|104.4406923 unknown
InChI: InChI=1S/C13H10ClNOS/c14-10-6-8-12(9-7-10)17-13(16)15-11-4-2-1-3-5-11/h1-9,15H
charge 0 multiplicity 1
27 atoms
Cl 6.394231 1.325175 -0.018177
S  0.757166 -1.815226 -0.151227
O  -0.215164 0.738003 0.489665
N  -1.780976 -0.900699 -0.169185
C  -3.033117 -0.225061 -0.029195
C  2.327203 -0.865802 -0.106227
C  -4.203931 -0.967207 -0.339031
C  -3.140083 1.125718 0.392509
C  2.674203 -0.07927 1.015874
C  3.212281 -0.983941 -1.203058
C  -5.472994 -0.364685 -0.228055
C  -4.419636 1.712696 0.499374
C  -5.589272 0.980708 0.192712
C  -0.518345 -0.411602 0.105684
C  3.913125 0.59933 1.041339
C  4.46141 -0.323101 -1.177041
C  4.78797 0.461046 -0.05379
H  -4.12215 -2.012513 -0.664015
H  -2.239412 1.696505 0.626193
H  -1.830826 -1.861952 -0.518934
H  1.985822 0.015437 1.859055
H  2.930631 -1.582264 -2.074908
H  -6.368889 -0.946787 -0.469737
H  -4.498105 2.755891 0.824817
H  -6.575046 1.449343 0.278864
H  4.189596 1.216623 1.90049
H  5.155209 -0.410566 -2.017595
