program: Gaussian 09
title: 000188031
version: EM64L-G09RevD.01
frameworkgroup: C1[X(C17H12Br2O6)]
method: RPBEPBE
basis: SDD
operation: Freq
keyword: #p
keyword: freq=noraman
keyword: PBEPBE/SDD
title: #p freq=noraman PBEPBE/SDD
converged: NO YES NO NO
title: Mulliken charges:
elementType: Br Br O O O O O O C C C C C C C C C C C C C C C C C H H H H H H H H H H H H
charge: 0.044700 -0.020382 -0.129408 -0.212995 -0.275964 -0.265111 -0.164811 -0.133479 -0.262307 -0.075787 0.073779 -0.510741 -0.341450 0.293426 0.090809 0.140312 0.275138 -0.546084 0.192289 -0.484403 -0.083913 -0.526499 -0.001822 0.083645 -0.529978 0.342617 0.271784 0.377270 0.346107 0.273989 0.262119 0.260549 0.255793 0.256410 0.252581 0.234122 0.237696
chargesum: 0.00000
title: Mulliken charges with hydrogens summed into heavy atoms:
elementType: Br Br O O O O O O C C C C C C C C C C C C C C C C C
charge: 0.044700 -0.020382 -0.129408 -0.212995 -0.275964 -0.265111 -0.164811 -0.133479 0.080310 0.195996 0.073779 -0.133471 0.004656 0.293426 0.090809 0.140312 0.275138 -0.272095 0.192289 0.038266 -0.083913 -0.014296 -0.001822 0.083645 0.194421
polarizability: 3.14822151e+02 -2.42420808e-01 2.88434742e+02 -3.87693869e+01 -7.52365377e+00 1.55671276e+02
1716.lowfreq: -7.8476 -4.0624 0.0007 0.0007 0.0010 4.6921 18.3096 30.6310 40.1759
frequency: 18.1250 30.6048 40.1546 48.3265 65.1702 78.9955 94.7660 113.9982 122.8714 135.9118 149.3138 175.5190 182.0632 189.5436 206.7030 224.3974 238.8179 249.9712 270.8901 292.5226 311.2062 327.4860 355.7510 400.6685 419.3466 448.2286 490.1562 515.9525 526.4618 532.9888 549.3386 556.6835 594.4372 604.5887 610.2899 654.1296 664.2328 673.1030 690.9014 717.4622 723.7545 753.3666 766.9596 780.7414 807.1892 824.1804 830.1961 839.5279 862.7462 874.7985 891.6642 915.3624 928.5142 970.2737 990.4751 1000.4829 1011.0463 1034.2910 1039.0790 1066.0165 1097.9087 1111.6935 1128.9978 1141.3042 1158.3444 1160.4452 1181.4286 1186.0387 1199.9311 1203.4866 1244.6843 1249.5220 1254.2898 1266.4298 1272.7175 1284.2797 1287.0995 1307.1926 1313.8774 1349.4103 1390.9484 1426.3390 1438.2112 1443.2132 1463.9760 1469.0091 1474.0243 1480.5243 1546.4470 1603.4503 1621.8925 1632.7983 1739.7969 2977.6993 3014.2713 3025.1980 3059.5688 3067.5484 3074.5653 3081.4558 3138.4722 3139.5337 3158.9679 3167.7737 3202.0745
redmass: 16.2490 8.6174 6.8248 11.4347 6.4741 9.5081 3.2828 12.0577 5.6702 2.6188 6.4290 5.6840 8.2803 2.5254 5.6669 6.5698 5.9582 1.9373 8.6433 6.4444 5.3747 5.5581 7.9737 7.3467 7.6867 9.6033 7.7058 8.1871 4.6886 6.0342 2.6398 7.8551 7.3753 7.5564 3.9403 7.6590 8.0307 8.1092 6.1174 4.2823 6.9186 5.8920 4.6703 5.5526 4.3170 7.2068 1.8055 2.2896 5.7991 6.1215 4.7426 3.5514 4.0485 4.5262 2.2036 3.4550 3.3513 4.5309 5.5067 2.4743 8.4301 1.2584 2.9060 1.2117 1.4402 1.3140 1.3300 1.2771 1.1129 1.6255 1.4229 1.6035 1.6753 1.7723 3.5895 2.0590 1.5552 2.1167 1.4986 4.0551 6.6574 1.2029 1.3093 1.1781 1.6145 1.0612 3.2648 1.9644 7.9258 10.6390 9.7713 12.4581 12.8433 1.0319 1.0602 1.0635 1.1009 1.0864 1.1050 1.1009 1.1012 1.0907 1.0890 1.0929 1.0921
irintensity: 0.7835 2.7354 0.1921 1.6726 0.9509 0.1790 3.3386 0.9377 1.2610 3.5370 1.1116 3.8998 1.4655 0.3860 1.1795 2.2394 0.2127 2.4408 5.3117 8.1114 6.6320 4.0025 3.2718 6.7142 2.4921 25.2942 13.1791 16.6726 11.9310 25.9151 8.4387 96.7997 45.0412 13.8393 0.7777 9.8109 26.2051 16.4378 15.1753 2.2242 20.7666 27.3230 15.3119 69.8120 1.0513 5.3897 2.4324 31.9368 230.5197 23.4404 32.0608 110.9430 21.3754 40.1898 0.3333 48.3343 44.0105 124.5805 35.7897 68.4970 100.9781 0.0370 37.8277 0.2592 35.6485 7.2446 44.9020 22.2447 0.1880 39.9683 22.0487 9.3715 47.2836 6.9031 19.1675 68.9393 65.6676 10.3448 4.3282 147.9517 64.8063 16.0349 51.6635 25.5197 70.5379 16.5873 216.8694 32.9018 162.2168 333.5730 503.1052 30.7337 520.0540 56.5314 12.5636 2.7644 0.5849 0.8927 28.0113 9.5945 13.7183 10.8507 2.3159 0.3444 0.4645
temp: 298.150 k
press: 1.00000 atm
elementType: 35 35 8 8 8 8 8 8 6 6 6 6 6 6 6 6 6 6 6 6 6 6 6 6 6 1 1 1 1 1 1 1 1 1 1 1 1
symmnumber: 1
zpe: 674212.8 jmol-1
zpe.correction: 0.256794 hartree
zpe.thermalcorrener: 0.278735 hartree
zpe.thermalcorrenthalpy: 0.279679 hartree
zpe.thermalcorrgfe: 0.202948 hartree
zpe.sumelectzpe: -1131.487289 hartree
zpe.sumelectthermal: -1131.465348 hartree
zpe.sumelectthermalent: -1131.464404 hartree
zpe.sumelectthermalfe: -1131.541136 hartree
dipole: -1.7293 9.1341 -2.7428
dipole: 9.6926
quadrupole: -154.3876 -180.9410 -158.5002
quadrupole: -38.2288 0.2157 -1.8466
quadrupole: 10.2220 -16.3314 6.1094 -38.2288 0.2157 -1.8466
hfenergy: -1131.7440835 hartree
pointgroup: C01 [X(C17H12Br2O6)]
dipole: 0.0661957 -3.733414 0.7739058 debye
polarizability: 317.6617733|2.55985|288.5951315|30.8801778|10.8546919|152.6712641 unknown
InChI: InChI=1S/C17H12Br2O6/c1-22-7-4-8-11(12-13(18)15(19)25-17(12)23-8)14-10(7)5-2-3-6(20)9(5)16(21)24-14/h4,12-13,15,17H,2-3H2,1H3
charge 0 multiplicity 1
37 atoms
Br 4.205918 2.996605 0.408273
Br 2.641848 -0.299294 -2.610866
O  4.41013 -0.413112 -0.251024
O  2.820483 -1.828212 0.92849
O  -0.263963 1.684789 0.399154
O  -1.914425 -2.89401 0.100741
O  -4.628954 2.78116 -0.356033
O  -1.626517 3.542833 0.151367
C  2.522962 0.61854 0.905782
C  3.574378 -0.545007 0.950309
C  1.232367 -0.137428 0.660696
C  2.990721 1.499315 -0.280696
C  3.852311 0.560188 -1.134305
C  1.474063 -1.519921 0.685543
C  -0.074104 0.312629 0.437519
C  -1.153795 -0.621014 0.245849
C  -2.45995 -0.05831 0.019275
C  0.477552 -2.49461 0.510674
C  -0.837766 -2.030969 0.290379
C  -3.767185 -0.803643 -0.211055
C  -2.663361 1.326464 -0.01526
C  -4.836924 0.299021 -0.395143
C  -4.096861 1.647476 -0.264781
C  -1.610181 2.309397 0.163387
C  -1.656252 -4.342588 0.120117
H  2.493104 1.20606 1.836394
H  4.263867 -0.601948 1.801619
H  2.186836 2.022732 -0.80989
H  4.651293 1.011081 -1.73183
H  0.736582 -3.553452 0.536882
H  -3.67594 -1.467841 -1.088454
H  -3.978851 -1.473561 0.640821
H  -5.63606 0.252348 0.365819
H  -5.33256 0.255279 -1.381184
H  -2.637687 -4.806833 -0.050816
H  -1.255259 -4.658463 1.100978
H  -0.957221 -4.628603 -0.687232
