program: Gaussian 09
title: 000196319
version: EM64L-G09RevD.01
frameworkgroup: C1[X(C15H20O3)]
method: RPBEPBE
basis: SDD
operation: Freq
keyword: #pfreq=noraman
keyword: PBEPBE/SDD
title: #p freq=noraman PBEPBE/SDD
converged: YES YES NO NO
title: Mulliken charges:
elementType: O O O C C C C C C C C C C C C C C C H H H H H H H H H H H H H H H H H H H H
charge: -0.235704 -0.404486 -0.198548 0.374399 -0.334186 -0.559476 -0.491550 -0.002757 -0.662159 0.424037 0.635239 -0.433468 -0.771434 -0.590604 -0.019322 0.102487 -0.810976 -0.774269 0.235264 0.246776 0.234269 0.253808 0.199923 0.261062 0.244827 0.211176 0.217170 0.212744 0.214771 0.241740 0.213604 0.222152 0.363079 0.228400 0.227124 0.253648 0.221294 0.249946
chargesum: 0.00000
title: Mulliken charges with hydrogens summed into heavy atoms:
elementType: O O O C C C C C C C C C C C C C C C
charge: -0.235704 -0.041407 -0.198548 0.374399 -0.098922 -0.078431 -0.037820 -0.002757 -0.156270 0.424037 0.635239 -0.005122 -0.102178 -0.154849 -0.019322 0.102487 -0.355451 -0.049381
polarizability: 2.13719041e+02 -1.79513018e+00 1.62269252e+02 -6.23052193e+00 6.77377918e+00 1.28088279e+02
1716.lowfreq: -15.3967 -12.5259 -0.0007 -0.0003 0.0008 8.6190 58.5680 69.3664 85.1036
frequency: 58.5484 69.2656 85.0828 104.8368 116.6813 147.2871 155.7282 187.4784 212.6400 224.4210 247.6710 269.9328 276.6935 279.2027 303.9235 313.0092 351.5520 360.5612 382.9235 397.8730 438.3804 449.5324 484.3896 511.2424 519.8967 559.7083 598.4934 626.3793 629.2582 669.9471 688.5811 699.9405 713.5626 730.3638 807.2567 808.6979 825.1769 860.3391 874.6112 881.4352 908.1414 930.6246 945.7045 953.3251 968.9836 975.2846 991.4117 999.7135 1026.6585 1032.9179 1042.2441 1053.8298 1072.6370 1097.7772 1133.8733 1145.7443 1154.6802 1157.7842 1172.9108 1194.0893 1207.9372 1239.3456 1260.2904 1278.9499 1293.8261 1295.8365 1304.2517 1311.6482 1316.0054 1327.5453 1338.8299 1345.0559 1388.2082 1391.3071 1404.2942 1434.6715 1448.4587 1455.7286 1458.0717 1461.8813 1466.3856 1468.5262 1471.8520 1485.9300 1493.0096 1660.5095 1687.0882 1706.0992 2958.1394 2972.1323 2972.2033 2975.1379 2981.8418 2986.8215 2992.5197 2997.6655 3033.4227 3040.8363 3044.5317 3054.7522 3060.9724 3064.4870 3065.5083 3082.2579 3087.5937 3097.7666 3184.5989 3554.6147
redmass: 3.7687 5.5665 1.0752 3.3762 3.5552 2.6044 4.2942 1.1480 3.2750 2.6904 2.4789 3.0552 2.9820 1.5619 2.4731 2.7925 3.1752 2.7015 3.0489 2.3174 3.2005 2.2139 5.6182 3.3308 4.0033 3.2892 5.1033 3.7205 4.1798 4.3416 2.5099 2.6788 2.2474 2.5965 2.3006 3.1285 2.5581 1.6512 3.9179 2.6420 2.5784 1.8235 1.3901 1.8531 2.1489 1.6673 2.1128 2.3368 2.3506 2.5794 1.6003 1.9080 2.0025 1.6112 2.1958 2.3190 2.1797 1.6502 2.2071 1.6170 1.5994 1.4175 1.4695 1.6568 1.8807 1.7169 1.2610 1.7059 2.1531 1.4279 1.5348 1.4708 1.7547 1.3761 1.3360 1.1637 1.0999 1.0464 1.1033 1.1022 1.0631 1.0674 1.0670 1.0836 1.0661 5.4381 10.8077 10.4171 1.0654 1.0665 1.0462 1.0701 1.0609 1.0369 1.0615 1.0613 1.0995 1.0953 1.1001 1.1006 1.0991 1.1000 1.0971 1.0623 1.0974 1.0998 1.1137 1.0655
irintensity: 0.1776 1.9192 0.8184 0.0887 2.5054 0.9204 0.2726 0.1704 0.9247 11.4480 10.6217 0.8205 11.7964 81.7843 6.9263 20.7543 14.8252 11.8816 15.2241 0.6665 4.9330 0.8701 9.9334 3.6494 2.9145 15.4618 5.3637 4.9345 2.6177 4.1582 7.9319 8.9478 5.6513 1.3665 1.8255 58.3945 5.6616 22.5163 76.3063 35.7496 8.5542 16.6753 51.0591 13.1038 11.8736 37.1505 44.4275 7.3147 28.1286 63.2982 0.9996 34.0387 9.2652 3.4352 15.8014 2.6750 22.4612 62.5675 1.8854 2.4391 2.1214 3.6564 10.6754 6.6983 0.2938 10.7891 10.3014 8.1257 5.6320 3.4125 7.6047 1.4814 3.4621 32.5744 29.5854 7.5688 7.1341 9.6908 12.9960 8.2387 2.6215 15.2911 19.1618 9.5402 5.6095 22.9095 432.2124 58.4090 23.6166 17.8013 22.5115 10.7670 38.4416 15.8206 58.6222 17.0496 22.4424 42.3651 11.6426 46.6938 37.7231 19.0503 12.3794 8.5431 26.3518 13.6769 21.5497 16.9263
temp: 298.150 k
press: 1.00000 atm
elementType: 8 8 8 6 6 6 6 6 6 6 6 6 6 6 6 6 6 6 1 1 1 1 1 1 1 1 1 1 1 1 1 1 1 1 1 1 1 1
symmnumber: 1
zpe: 834336.6 jmol-1
zpe.correction: 0.317782 hartree
zpe.thermalcorrener: 0.335032 hartree
zpe.thermalcorrenthalpy: 0.335976 hartree
zpe.thermalcorrgfe: 0.274481 hartree
zpe.sumelectzpe: -807.893106 hartree
zpe.sumelectthermal: -807.875856 hartree
zpe.sumelectthermalent: -807.874912 hartree
zpe.sumelectthermalfe: -807.936407 hartree
dipole: 5.3925 0.7053 -0.3379
dipole: 5.4489
quadrupole: -131.6790 -98.9966 -108.7667
quadrupole: -7.6291 2.0497 1.1116
quadrupole: -18.5315 14.1508 4.3807 -7.6291 2.0497 1.1116
hfenergy: -808.2108875 hartree
pointgroup: C01 [X(C15H20O3)]
dipole: 2.1258663 -0.2432183 0.1313407 debye
polarizability: 213.6432045|2.599788|162.2323459|6.1512885|7.1466264|128.2010225 unknown
InChI: InChI=1S/C15H20O3/c1-9-5-4-6-14(3)8-15(17)12(7-11(9)14)10(2)13(16)18-15/h11,17H,1,4-8H2,2-3H3
charge 0 multiplicity 1
38 atoms
O  -2.564754 1.299056 -0.239925
O  -0.988872 1.625938 1.525176
O  -4.500591 0.010096 -0.548965
C  1.272828 0.869209 -0.648122
C  1.214092 -0.692573 -0.41828
C  -0.16642 1.455292 -0.836939
C  2.008265 1.555188 0.546491
C  -1.177345 1.002199 0.2298
C  0.19481 -1.108525 0.711551
C  -1.139752 -0.504698 0.420643
C  2.598096 -1.258817 -0.104663
C  3.411063 0.963569 0.820468
C  2.040628 1.147151 -1.970113
C  3.344799 -0.57435 1.03136
C  -2.366994 -1.03838 0.160183
C  -3.300696 0.066352 -0.230965
C  3.117421 -2.304956 -0.798846
C  -2.842473 -2.461713 0.202868
H  0.848953 -1.154265 -1.359191
H  -0.561708 1.127576 -1.817216
H  -0.118989 2.562637 -0.863855
H  1.391027 1.46538 1.459225
H  2.096817 2.63975 0.331644
H  0.559852 -0.742373 1.690355
H  0.146838 -2.209904 0.765626
H  3.843027 1.440635 1.721224
H  4.09685 1.189002 -0.018131
H  1.518553 0.689744 -2.831908
H  2.115512 2.235281 -2.156697
H  3.061818 0.731082 -1.945721
H  2.824998 -0.771007 1.993059
H  4.361741 -0.99656 1.128827
H  -1.10136 2.605845 1.420364
H  2.568353 -2.780448 -1.621158
H  4.106701 -2.716231 -0.564786
H  -3.616743 -2.587036 0.982191
H  -2.018031 -3.162221 0.416206
H  -3.314515 -2.746324 -0.75508
