program: Gaussian 09
title: 000188030
version: EM64L-G09RevD.01
frameworkgroup: C1[X(C13H20O8)]
method: RPBEPBE
basis: SDD
operation: Freq
keyword: #pfreq=noraman
keyword: PBEPBE/SDD
title: #p freq=noraman PBEPBE/SDD
converged: YES YES NO NO
title: Mulliken charges:
elementType: O O O O O O O O C C C C C C C C C C C C C H H H H H H H H H H H H H H H H H H H H
charge: -0.234528 -0.259131 -0.436072 -0.439799 -0.412082 -0.230023 -0.407394 -0.203351 -0.208441 -0.431394 -0.426609 -0.223898 -0.076497 -0.201095 0.008254 -0.402786 -0.399403 -0.383776 -0.099342 0.253754 0.178315 0.251978 0.240956 0.230831 0.205647 0.216013 0.219817 0.205785 0.275672 0.238415 0.239403 0.194564 0.196161 0.233416 0.182675 0.203359 0.244581 0.357753 0.365430 0.344946 0.387897
chargesum: 0.00000
title: Mulliken charges with hydrogens summed into heavy atoms:
elementType: O O O O O O O O C C C C C C C C C C C C C
charge: -0.234528 -0.259131 -0.078319 -0.074369 -0.067136 -0.230023 -0.019498 -0.203351 0.043536 -0.009734 -0.001007 0.017058 0.154334 0.074578 0.246669 0.031181 0.030175 0.002258 0.145239 0.253754 0.178315
polarizability: 1.96847414e+02 -1.64584540e+00 1.61085166e+02 -3.12766393e+00 -1.52391154e+00 1.37517278e+02
1716.lowfreq: -38.5837 -5.0654 -2.9501 -0.0010 -0.0006 -0.0002 6.6875 27.1362 31.7357
frequency: -35.6849 27.0845 31.6795 35.6098 45.3853 69.3591 93.7588 101.0248 121.5900 128.4391 156.8887 177.9069 184.3641 220.2500 235.2500 257.4627 260.6286 267.4831 275.0490 313.6783 324.1519 340.1136 358.7560 393.3099 409.3293 428.1059 442.0860 453.4527 474.8711 494.0047 525.5162 531.6282 560.4306 605.4156 627.8654 636.4924 708.1330 716.9254 728.5425 787.0011 788.1409 816.5396 862.2900 866.3790 886.5775 890.3739 928.0370 938.1598 939.7175 958.9457 977.0163 1001.0187 1016.2932 1029.5389 1045.2951 1049.2503 1049.8738 1063.8243 1070.6496 1080.3010 1093.2099 1096.8754 1106.5571 1118.7812 1127.4167 1146.5306 1177.0064 1205.2468 1212.6365 1237.9098 1240.7853 1251.6665 1260.1716 1271.1350 1284.2020 1285.4705 1302.7514 1317.4515 1328.7600 1331.1452 1339.3118 1347.1316 1347.3197 1354.1498 1355.7953 1362.1544 1377.3893 1380.0918 1384.1623 1395.2545 1461.5180 1464.1797 1469.1772 1476.3830 1480.8707 1659.5836 1679.7164 2960.3941 2971.5005 2973.5567 2973.9765 2983.5707 2988.1541 2990.1911 2990.4220 3000.8427 3029.4260 3034.2473 3037.3091 3043.0469 3046.4842 3049.4518 3057.4805 3509.4759 3525.7216 3549.3343 3563.9311
redmass: 3.9578 7.9513 8.5053 4.8279 5.0472 5.1932 3.2948 4.5623 1.5348 5.4665 5.1055 4.3406 4.0984 3.1556 4.6214 3.0400 5.4683 3.5020 3.7127 2.9093 4.8728 1.8840 1.7370 6.1260 5.5502 3.2878 2.3131 1.5760 3.3164 2.3729 4.1476 3.8777 2.9441 3.6761 1.6859 3.1231 5.5649 3.9124 4.5474 3.7354 1.4745 2.8732 2.3757 2.0616 2.6554 5.0539 5.4862 1.3690 4.8635 6.3962 7.3116 3.1024 4.2582 2.7704 2.6628 1.8986 2.5043 3.0115 3.0605 2.5071 3.9462 1.8133 3.2012 1.0596 1.9093 1.5906 1.2476 1.3141 1.2972 1.2841 1.3063 1.1607 1.3070 1.2944 1.3338 1.3111 1.3106 1.3309 1.4547 1.3067 1.2679 1.3884 1.3784 1.4171 1.4207 1.5652 1.4504 1.3914 1.1952 1.7634 1.0897 1.0808 1.0834 1.0816 1.0952 9.3991 9.2857 1.0637 1.0831 1.0619 1.0624 1.0847 1.0628 1.0658 1.0808 1.0850 1.0960 1.0990 1.0993 1.0852 1.0860 1.1030 1.1021 1.0640 1.0653 1.0661 1.0663
irintensity: 0.0232 2.8569 0.7910 0.9701 5.3148 7.9153 28.8317 1.0132 67.2918 7.1551 1.2117 0.5756 4.0614 7.5745 2.5203 1.8298 14.8583 3.5354 8.5066 13.5767 7.0348 93.0968 0.1002 5.6977 5.6448 0.3320 100.6911 81.9827 37.7397 3.2854 22.3822 1.3239 9.0149 56.2020 72.1072 11.8427 4.6058 29.2249 36.1001 10.8029 0.1425 5.6301 8.7122 20.1376 52.1754 43.0281 89.7059 10.6414 187.7381 88.3513 575.9564 53.4323 25.0030 24.5562 67.7981 20.5499 67.1927 251.6584 98.3082 46.9186 59.5254 0.3017 16.4260 1.3884 6.8907 0.6168 47.2126 21.7677 9.8102 19.8784 7.4661 38.1882 0.0123 1.0458 1.7153 6.4064 39.0482 3.7129 20.5227 0.2597 0.1732 0.3587 0.8895 1.7488 1.3979 16.4866 20.6089 60.6986 25.7936 6.5641 3.1278 3.8780 15.2447 21.2020 11.7600 130.9043 191.4092 42.8310 10.3852 14.5803 44.5321 10.9697 29.9133 39.4012 13.0014 46.8735 72.3005 59.2714 3.3661 11.0424 20.9822 7.6847 89.7003 30.8976 20.8251 13.4780 20.8378
temp: 298.150 k
press: 1.00000 atm
elementType: 8 8 8 8 8 8 8 8 6 6 6 6 6 6 6 6 6 6 6 6 6 1 1 1 1 1 1 1 1 1 1 1 1 1 1 1 1 1 1 1 1
symmnumber: 1
zpe: 860208.7 jmol-1
zpe.correction: 0.327636 hartree
zpe.thermalcorrener: 0.348495 hartree
zpe.thermalcorrenthalpy: 0.349439 hartree
zpe.thermalcorrgfe: 0.276758 hartree
zpe.sumelectzpe: -1107.495793 hartree
zpe.sumelectthermal: -1107.474935 hartree
zpe.sumelectthermalent: -1107.473990 hartree
zpe.sumelectthermalfe: -1107.546671 hartree
dipole: -0.5113 -0.4191 -0.2752
dipole: 0.7161
quadrupole: -116.4263 -119.7335 -124.8468
quadrupole: 1.8510 10.3531 -7.5822
quadrupole: 3.9092 0.6020 -4.5112 1.8510 10.3531 -7.5822
hfenergy: -1107.8234291 hartree
pointgroup: C01 [X(C13H20O8)]
dipole: 0.2031492 0.1115004 -0.1602369 debye
polarizability: 196.3898097|1.8233868|158.03578|6.1080691|-7.8926481|141.0242681 unknown
InChI: InChI=1S/C13H20O8/c14-7-8(15)10(11(17)18)20-13(9(7)16)21-12(19)6-4-2-1-3-5-6/h6-10,13-17H,1-5H2
charge 0 multiplicity 1
41 atoms
O  1.246399 -0.386551 0.789463
O  -0.645654 0.902675 0.417555
O  3.74791 2.711816 -0.71547
O  0.919069 2.740189 -1.206824
O  4.907799 0.031639 -0.058431
O  -1.676701 -0.644243 -1.009242
O  3.255319 -3.077499 0.772672
O  3.286969 -1.598387 2.570245
C  -3.02463 0.623352 0.660795
C  -4.136082 1.129304 -0.309417
C  -3.562969 -0.544937 1.54994
C  2.94429 1.484019 -0.61514
C  1.496702 1.851262 -0.206352
C  3.546913 0.417825 0.315161
C  0.640713 0.579596 -0.15084
C  -4.818131 -0.004425 -1.110981
C  -4.232167 -1.671991 0.730474
C  -5.355937 -1.112817 -0.174924
C  2.587148 -0.80782 0.339272
C  -1.778671 0.190985 -0.088097
C  3.069321 -1.829334 1.366412
H  -2.718409 1.453539 1.321027
H  2.917452 1.10127 -1.656614
H  1.504119 2.320903 0.800928
H  -4.897201 1.637871 0.317165
H  -3.721203 1.894094 -0.993429
H  -2.746112 -0.947377 2.178831
H  -4.311168 -0.102403 2.238936
H  3.640133 0.796526 1.350055
H  0.517364 0.117162 -1.152368
H  -4.092029 -0.444649 -1.819692
H  -5.644676 0.422371 -1.711868
H  -4.639649 -2.434003 1.422877
H  -3.473554 -2.175235 0.10109
H  -6.167696 -0.698753 0.460188
H  -5.802376 -1.929838 -0.773631
H  2.536824 -1.281607 -0.663392
H  4.198329 2.888469 0.149533
H  1.585297 3.458431 -1.374498
H  4.960298 -0.099444 -1.040242
H  3.584946 -3.726587 1.452938
