program: Gaussian 09
title: 000188029
version: EM64L-G09RevD.01
frameworkgroup: C1[X(C15H22O7)]
method: RPBEPBE
basis: SDD
operation: Freq
keyword: #pfreq=noraman
keyword: PBEPBE/SDD
title: #p freq=noraman PBEPBE/SDD
converged: YES YES NO NO
title: Mulliken charges:
elementType: O O O O O O O C C C C C C C C C C C C C C C H H H H H H H H H H H H H H H H H H H H H H
charge: -0.282316 -0.271096 -0.438286 -0.429767 -0.424010 -0.437207 -0.434861 -0.061471 -0.227697 -0.131751 -0.114296 -0.107444 -0.321650 -0.243384 -0.410043 -0.565013 0.513878 -0.397061 -0.376112 -0.384438 -0.349136 0.279082 0.181974 0.294177 0.281906 0.224372 0.251086 0.205121 0.238049 0.203099 0.205994 0.354582 0.333798 0.335419 0.222386 0.232592 0.203317 0.209034 0.350245 0.233454 0.232978 0.217947 0.249740 0.352810
chargesum: 0.00000
title: Mulliken charges with hydrogens summed into heavy atoms:
elementType: O O O O O O O C C C C C C C C C C C C C C C
charge: -0.282316 -0.271096 -0.083703 -0.095969 -0.088591 -0.086962 -0.082051 0.120503 0.066480 0.150155 0.110076 0.143642 0.121520 0.165708 0.044934 -0.152662 0.513878 -0.163607 -0.143134 -0.166490 -0.099396 0.279082
polarizability: 2.23475026e+02 -2.49404808e+00 1.76624086e+02 2.28847926e+01 1.09092608e+01 1.53444122e+02
1716.lowfreq: -19.8971 -9.1757 -6.2195 -0.0008 -0.0003 0.0006 4.8870 11.8702 18.2154
frequency: -10.7192 -3.8706 17.9345 34.6465 36.5997 62.2513 82.2638 84.8762 98.6910 133.9043 148.1126 161.3162 164.1608 185.9883 242.1064 266.5901 277.5709 295.9063 299.5610 309.6522 341.5421 351.8755 357.0437 358.0375 378.0822 397.9657 402.5841 410.2999 432.4892 458.8457 479.1055 486.4153 490.2345 498.6985 534.1829 543.4567 585.8402 618.4056 636.6538 718.2815 721.3271 754.1991 762.8409 784.8063 807.1484 824.1169 837.5422 856.8491 863.9427 926.9365 931.0238 935.9410 942.2845 959.2142 961.4490 1003.1412 1003.5631 1008.1463 1024.1288 1028.9731 1037.0367 1052.4037 1068.7347 1078.5995 1081.7396 1106.8160 1112.5280 1118.5337 1144.4728 1161.6561 1165.7703 1169.0677 1179.3272 1200.0869 1216.7875 1230.9529 1248.1467 1259.2033 1262.1703 1262.6707 1271.1153 1277.7070 1286.2226 1304.0275 1318.8829 1321.3389 1328.1479 1331.6882 1340.6956 1348.1504 1359.5974 1373.3029 1377.7289 1380.8800 1390.7365 1392.0804 1426.4152 1467.9843 1471.8340 1479.6083 1491.7201 1505.5528 1598.2322 1628.2858 2885.4785 2944.6339 2969.9242 2974.2686 2985.4872 3000.7976 3002.3100 3018.4690 3024.7652 3069.4788 3082.2565 3090.0283 3107.9753 3108.7805 3121.3839 3134.7343 3169.5926 3505.3102 3513.4207 3518.2669 3533.3328 3582.4081
redmass: 6.3033 5.7871 3.7734 6.1650 4.7673 5.8869 1.9166 5.3831 5.6048 3.4167 3.5163 4.6847 4.9612 4.6669 5.0224 4.7209 4.0712 3.0298 3.4539 4.2398 3.6702 1.2548 1.3180 1.3878 3.4548 4.3758 3.3502 3.0111 3.7845 4.1882 2.1850 1.5232 1.7970 1.8919 2.9297 3.0222 3.7167 5.1342 6.7514 3.8231 4.2779 3.7950 1.1399 3.2785 1.4161 3.1806 1.8495 1.3300 3.4776 4.1790 1.5530 6.1753 4.3965 1.3792 3.4014 3.7853 2.8932 5.2394 3.3594 2.9508 4.0765 1.5077 2.9470 3.4925 4.1319 2.3486 1.3710 2.2656 1.3801 1.1845 1.2209 1.1698 1.1103 1.3643 2.2069 1.2794 2.8626 1.2902 1.4627 1.2600 1.2678 1.1055 1.2476 1.3424 1.2102 1.2369 1.1738 1.3165 1.4188 1.4116 1.2139 1.2206 1.3545 1.4800 1.4890 4.7507 2.8029 1.0832 1.0894 1.0900 1.0902 2.7848 6.4322 6.4837 1.0823 1.0560 1.0726 1.0596 1.0790 1.1015 1.0626 1.0871 1.1014 1.1049 1.0967 1.0860 1.0862 1.0875 1.0899 1.0963 1.0951 1.0651 1.0651 1.0657 1.0659 1.0660
irintensity: 0.7093 0.1529 1.0728 0.6330 0.3485 3.3979 0.7020 0.6026 4.2040 1.5261 10.8668 3.5384 3.1225 1.5365 17.5638 2.2378 8.4468 5.8614 1.6355 2.9694 15.2631 70.2511 11.8147 199.7080 18.6519 6.6041 14.6167 2.8930 7.5323 5.8631 18.7838 202.5401 102.9276 92.6522 7.5376 26.1341 28.7079 3.9052 0.8746 4.6637 52.4426 24.0512 2.7256 3.4781 28.7263 8.8170 38.2603 6.3216 96.9453 175.5027 23.4361 10.7317 66.0421 1.9377 74.7781 221.4345 6.4074 13.3916 37.5365 42.2771 40.8093 5.6043 62.0286 3.5039 43.7097 22.3440 44.5662 38.2915 208.1623 1.3229 15.4413 30.1598 3.8909 55.2642 2.4482 8.5649 27.5884 3.6740 17.6577 7.7744 46.2010 2.6867 19.6667 12.1068 7.0421 36.4530 12.6385 6.5781 7.6008 10.7285 24.3758 11.5849 38.4842 0.7629 16.0987 7.4752 12.0998 2.2046 1.6697 3.8533 9.6649 105.5181 9.6549 27.0958 61.5904 38.2902 15.0328 35.2326 78.3576 26.9461 29.1444 29.0033 5.5918 46.0097 22.0711 8.0646 4.4236 18.8977 19.2865 14.5935 6.1582 16.4180 5.9465 4.0518 7.2458 38.8529
temp: 298.150 k
press: 1.00000 atm
elementType: 8 8 8 8 8 8 8 6 6 6 6 6 6 6 6 6 6 6 6 6 6 6 1 1 1 1 1 1 1 1 1 1 1 1 1 1 1 1 1 1 1 1 1 1
symmnumber: 1
zpe: 934830.7 jmol-1
zpe.correction: 0.356058 hartree
zpe.thermalcorrener: 0.377293 hartree
zpe.thermalcorrenthalpy: 0.378237 hartree
zpe.thermalcorrgfe: 0.304959 hartree
zpe.sumelectzpe: -1109.588565 hartree
zpe.sumelectthermal: -1109.567331 hartree
zpe.sumelectthermalent: -1109.566386 hartree
zpe.sumelectthermalfe: -1109.639664 hartree
dipole: -0.1778 2.7732 -0.7480
dipole: 2.8778
quadrupole: -121.0545 -147.9583 -129.5114
quadrupole: -1.7029 3.7050 10.9639
quadrupole: 11.7869 -15.1169 3.3300 -1.7029 3.7050 10.9639
hfenergy: -1109.9446234 hartree
pointgroup: C01 [X(C15H22O7)]
dipole: 0.1752073 -1.1100059 0.1382812 debye
polarizability: 219.8024734|-8.5108901|163.76562|-25.114894|-16.5816955|169.9751412 unknown
InChI: InChI=1S/C15H22O7/c16-8-11-12(18)13(19)14(20)15(22-11)21-7-1-2-9-3-5-10(17)6-4-9/h3-6,11-20H,1-2,7-8H2
charge 0 multiplicity 1
44 atoms
O  3.218185 -0.787427 -1.321011
O  1.260232 0.598396 -0.901102
O  4.229266 2.731518 0.770128
O  4.381632 0.22745 2.150357
O  4.259005 2.010234 -2.420061
O  2.612971 -3.240958 -0.08839
O  -7.012562 0.315354 2.029502
C  4.202337 1.477803 0.02665
C  3.605145 0.352401 0.896687
C  3.394624 1.698949 -1.27621
C  3.572818 -0.982014 0.127181
C  2.50965 0.476894 -1.618079
C  2.607448 -2.020094 0.719546
C  0.174494 -0.263115 -1.426189
C  -1.06847 -0.017299 -0.569068
C  -2.271674 -0.880131 -1.042523
C  -3.533235 -0.60573 -0.236303
C  -3.893173 -1.418072 0.866839
C  -4.366218 0.50219 -0.547104
C  -5.041945 -1.139348 1.641082
C  -5.515735 0.796604 0.211564
C  -5.85201 -0.027348 1.310297
H  5.240373 1.169424 -0.253036
H  2.600225 0.644521 1.240902
H  2.757116 2.586587 -1.151995
H  4.592077 -1.420502 0.084635
H  2.349143 0.423919 -2.71264
H  1.589804 -1.583128 0.787468
H  2.937683 -2.316483 1.728983
H  0.485311 -1.327617 -1.382918
H  -0.013943 0.003938 -2.488365
H  4.522029 2.517372 1.696434
H  5.281325 -0.138608 1.939646
H  4.86426 1.239296 -2.577231
H  -0.838449 -0.246448 0.488653
H  -1.334642 1.055075 -0.613025
H  -2.457645 -0.673214 -2.115683
H  -1.999643 -1.951224 -0.966971
H  2.558839 -2.952781 -1.038478
H  -3.271772 -2.284034 1.12621
H  -4.114407 1.14345 -1.401061
H  -5.303794 -1.785217 2.489706
H  -6.160399 1.647122 -0.029051
H  -7.161175 -0.315207 2.777124
