program: Gaussian 09
title: 000188022
version: EM64L-G09RevD.01
frameworkgroup: C1[X(C20H12O2)]
method: RPBEPBE
basis: SDD
operation: Freq
keyword: #pfreq=noraman
keyword: PBEPBE/SDD
title: #p freq=noraman PBEPBE/SDD
converged: YES YES NO NO
title: Mulliken charges:
elementType: O O C C C C C C C C C C C C C C C C C C C C H H H H H H H H H H H H
charge: -0.402681 -0.431397 0.022380 0.021411 0.311475 0.503114 0.246743 0.268533 0.511239 0.282376 -0.402730 -0.428654 -0.475539 -0.476843 -0.539306 0.108601 -0.471926 -0.367621 -0.431103 -0.438938 -0.261500 -0.241858 0.229773 0.186554 0.272511 0.239900 0.241111 0.229167 0.288447 0.219095 0.227157 0.232399 0.365816 0.362294
chargesum: 0.00000
title: Mulliken charges with hydrogens summed into heavy atoms:
elementType: O O C C C C C C C C C C C C C C C C C C C C
charge: -0.036865 -0.069103 0.022380 0.021411 0.311475 0.503114 0.246743 0.268533 0.511239 0.282376 -0.402730 -0.198881 -0.288985 -0.204332 -0.299406 0.108601 -0.230816 -0.138454 -0.142655 -0.219844 -0.034343 -0.009459
polarizability: 4.47912106e+02 1.13256705e+01 2.62523252e+02 -1.55551146e-03 1.02160651e-03 8.24215597e+01
1716.lowfreq: -8.8162 -5.1324 -0.0011 -0.0004 0.0004 6.9983 51.3549 59.4221 119.8876
frequency: 51.3375 59.4220 119.8875 130.9011 171.7817 188.9386 205.6380 258.8286 283.2168 288.7083 306.8780 314.1567 336.8998 364.1370 375.0876 397.6487 432.0833 438.0468 461.8165 473.4723 509.0099 516.1829 534.9336 552.3394 568.0364 568.7006 584.9193 634.6117 634.8841 682.6319 692.4481 704.1443 709.4980 762.4623 773.4505 776.4118 796.3797 798.1265 825.1759 846.7968 866.3540 873.6485 888.0246 918.0354 955.3100 965.0257 971.4775 989.6880 997.3612 997.5156 1030.3257 1051.0776 1079.3476 1123.5631 1136.1804 1157.0342 1165.5173 1174.8431 1187.6667 1202.3435 1211.9366 1245.8499 1257.4402 1264.8130 1305.8838 1321.3485 1366.8048 1386.1071 1402.4209 1408.1008 1412.1401 1427.9111 1435.4688 1444.5619 1474.6104 1485.2586 1508.7033 1518.9348 1567.3629 1589.7029 1596.5581 1606.1724 1620.9969 1634.1074 3083.5069 3112.0092 3129.3090 3135.9291 3143.8862 3145.8501 3154.0142 3165.2095 3178.2884 3180.1326 3585.1304 3594.3363
redmass: 4.4018 5.1758 4.6317 3.6424 4.5193 5.7625 2.9463 2.6043 2.6709 5.9931 6.4817 2.9257 6.4271 1.3563 2.6324 6.1738 3.4821 7.4308 6.8741 3.5152 5.2370 3.5746 6.7664 3.4687 5.2197 3.8792 6.0760 6.2965 3.7902 7.1815 3.2126 5.7427 2.6234 6.6131 1.7924 1.5135 2.0091 5.5777 1.6189 2.6193 1.4854 5.7561 4.5389 1.3551 1.4281 1.5204 2.2446 1.7269 4.8276 1.4227 3.1691 2.8633 3.0758 2.3719 1.7072 1.4122 1.4484 1.1747 1.3599 1.3614 1.8299 1.6835 1.6354 2.5664 2.4199 2.2816 4.4634 3.1260 2.8274 4.4886 3.2136 3.7203 3.3523 4.4056 4.0896 4.0129 4.3211 4.1292 6.6026 7.9034 6.3646 6.9467 6.4220 7.2799 1.0873 1.0883 1.0855 1.0956 1.0953 1.0900 1.0887 1.0934 1.0969 1.0964 1.0660 1.0653
irintensity: 0.9478 1.7701 1.7125 1.3854 6.9784 1.8883 0.3531 35.0264 61.8967 0.7099 7.3639 27.7863 8.9158 82.8047 48.8171 5.7684 1.2882 6.5269 4.3624 0.0340 0.1946 0.6660 0.3441 7.5710 0.4609 0.4052 7.0147 4.5440 12.7965 2.2756 0.0940 0.9697 8.4961 30.3450 94.8078 33.4874 6.1597 8.7293 55.2407 38.0128 4.9875 4.4320 98.7537 0.4441 6.1831 5.9435 2.4672 0.8524 4.4117 1.3582 16.0011 5.2960 147.5742 44.5122 165.2840 58.7465 26.8508 0.7205 40.0412 50.1514 91.8596 44.8779 2.6456 110.9009 5.7592 6.6421 20.9131 2.2756 10.4606 28.4439 19.1555 16.8559 6.9453 41.6902 47.3544 23.3571 67.6630 13.4984 27.3007 0.0211 3.3410 90.9112 5.4424 1.2114 16.8048 26.2155 4.8541 20.9493 29.0866 14.9338 5.7301 22.5792 13.5371 19.1916 76.0039 34.9490
temp: 298.150 k
press: 1.00000 atm
elementType: 8 8 6 6 6 6 6 6 6 6 6 6 6 6 6 6 6 6 6 6 6 6 1 1 1 1 1 1 1 1 1 1 1 1
symmnumber: 1
zpe: 675657.8 jmol-1
zpe.correction: 0.257344 hartree
zpe.thermalcorrener: 0.273027 hartree
zpe.thermalcorrenthalpy: 0.273971 hartree
zpe.thermalcorrgfe: 0.215339 hartree
zpe.sumelectzpe: -918.370719 hartree
zpe.sumelectthermal: -918.355037 hartree
zpe.sumelectthermalent: -918.354093 hartree
zpe.sumelectthermalfe: -918.412725 hartree
dipole: 2.5411 1.1879 0.0026
dipole: 2.8051
quadrupole: -98.5592 -107.4222 -134.7141
quadrupole: 3.0436 0.0019 0.0075
quadrupole: 15.0059 6.1430 -21.1489 3.0436 0.0019 0.0075
hfenergy: -918.6280637 hartree
pointgroup: C01 [X(C20H12O2)]
dipole: 1.0124271 -0.4392134 -0.0032891 debye
polarizability: 448.3933236|-6.1470331|261.9932773|1.5259479|2.7327331|82.4703173 unknown
InChI: InChI=1S/C20H12O2/c21-17-10-6-11-5-7-16-19-13(8-9-15(17)18(11)19)12-3-1-2-4-14(12)20(16)22/h1-10,21-22H
charge 0 multiplicity 1
34 atoms
O  -2.631822 -2.79301 -0.072737
O  4.315839 2.365998 0.037232
C  0.172752 -0.255521 -0.020485
C  1.615137 -0.205203 -0.013359
C  -0.591553 0.959167 -0.005224
C  -0.488324 -1.551392 -0.043392
C  -2.045166 0.888582 -0.012788
C  2.284629 1.06926 0.008955
C  2.393427 -1.423228 -0.028561
C  -2.698079 -0.401215 -0.035662
C  -1.900625 -1.593647 -0.050573
C  0.117343 2.212056 0.017127
C  0.323709 -2.753279 -0.058257
C  1.503061 2.273879 0.024042
C  1.70181 -2.692928 -0.051107
C  3.714778 1.09494 0.01546
C  3.807139 -1.343747 -0.021168
C  -2.880258 2.052845 0.001414
C  -4.129019 -0.483538 -0.043476
C  4.467011 -0.095405 0.000624
C  -4.275076 1.954401 -0.006384
C  -4.907509 0.674264 -0.029046
H  -0.445448 3.149121 0.029195
H  -0.146881 -3.745796 -0.075832
H  2.024499 3.234191 0.041087
H  2.297482 -3.612977 -0.062638
H  4.397027 -2.2670 -0.032696
H  -2.42602 3.047495 0.018829
H  -4.591034 -1.473621 -0.061087
H  5.564201 -0.055786 0.005878
H  -4.886332 2.863638 0.004933
H  -6.000653 0.604739 -0.035057
H  -2.034604 -3.579947 -0.08304
H  5.301761 2.287363 0.039995
