program: Gaussian 09
title: 000188014
version: EM64L-G09RevD.01
frameworkgroup: C1[X(C12H16Cl5N2O3P)]
method: RPBEPBE
basis: SDD
operation: Freq
keyword: #p
keyword: freq=noraman
keyword: PBEPBE/SDD
title: #p freq=noraman PBEPBE/SDD
converged: YES YES NO NO
title: Mulliken charges:
elementType: Cl Cl Cl Cl Cl P O O O N N C C C C C C C C C C C C H H H H H H H H H H H H H H H H
charge: 0.029531 0.000758 0.098349 0.149265 0.094987 1.347071 -0.539595 -0.485907 -0.574094 -0.782489 0.007905 -0.238003 -0.259077 0.700245 -0.346254 -0.359438 -0.289040 -0.230869 -0.676010 -0.673267 0.417284 -0.368973 -0.755376 0.349107 0.217541 0.241586 0.224931 0.223735 0.221309 0.213523 0.231077 0.219803 0.211209 0.230332 0.216478 0.212707 0.228107 0.211588 0.279963
chargesum: 0.00000
title: Mulliken charges with hydrogens summed into heavy atoms:
elementType: Cl Cl Cl Cl Cl P O O O N N C C C C C C C C C C C C
charge: 0.029531 0.000758 0.098349 0.149265 0.094987 1.347071 -0.539595 -0.485907 -0.574094 -0.433382 0.007905 0.221125 0.189589 0.700245 0.088579 0.091442 -0.289040 -0.230869 -0.017992 -0.020866 0.417284 -0.089010 -0.755376
polarizability: 2.56888763e+02 2.93991374e+00 2.51829064e+02 1.12031572e+01 -5.68692585e-01 1.88699505e+02
1716.lowfreq: -22.8054 -5.5678 -0.0009 -0.0008 0.0006 2.8267 6.4610 21.6316 28.2681
frequency: -22.0791 21.5643 28.1987 29.6322 32.9113 42.9070 57.1851 64.2159 73.8405 77.9223 108.7110 115.7500 126.3253 138.0096 159.7258 163.2309 164.6790 184.4642 197.9997 208.2487 224.2000 224.8735 226.5206 246.9560 256.0094 261.8883 266.9930 278.0355 298.8270 306.5858 338.8134 358.2228 368.7720 377.4692 406.8815 432.5540 445.9850 477.4605 510.5690 518.4208 535.5900 603.1520 611.0264 628.9323 687.6236 710.9170 728.7892 741.8595 763.7959 770.2390 776.7959 820.1595 833.8627 880.8464 881.6317 888.9467 890.7398 902.1615 943.0678 952.3950 989.8826 1042.9735 1043.7792 1047.9863 1053.3795 1122.2861 1123.6805 1151.0042 1152.3340 1219.1421 1234.0872 1238.8855 1240.1793 1287.0430 1288.5684 1305.9393 1310.3063 1315.9063 1340.4835 1364.4963 1368.0485 1395.2880 1395.9091 1413.6363 1414.7390 1466.1339 1468.5872 1476.6298 1478.2536 1479.5498 1481.5314 1488.3143 1491.8541 1513.3503 1527.6020 2979.3942 2981.6592 2996.5683 3001.5860 3004.2910 3011.3027 3046.7561 3050.8710 3072.1358 3072.3319 3084.8506 3087.1338 3089.2927 3092.8429 3165.3366 3462.8698
redmass: 2.8687 6.0523 5.2663 3.4743 6.7338 9.4730 7.3274 3.2990 5.0968 4.0627 1.7960 5.8019 9.1805 5.8988 10.6015 11.2677 3.6644 19.5736 17.2171 3.9353 1.3214 1.2301 4.6344 5.2845 7.4337 4.0190 5.5632 5.9669 8.0362 6.0567 5.5033 18.8643 9.7512 8.5662 10.1080 4.8178 10.4915 4.9178 2.7651 8.0089 4.9459 7.6461 8.2599 6.6580 8.2650 7.5288 9.0463 10.1664 1.0972 1.0815 9.7480 6.3438 5.0006 1.5035 1.6523 1.6591 1.2803 1.4134 4.5359 5.5650 7.8774 3.1951 3.0106 9.0889 13.4748 2.2199 2.1566 1.5523 1.5615 2.8287 4.2165 1.2552 1.2537 1.1068 1.1308 1.3167 1.2508 4.1086 6.8102 1.3350 1.3234 1.2022 1.2012 2.6070 1.5091 1.0843 1.0775 1.0566 1.0426 1.0423 1.0410 1.0837 1.0931 7.0307 6.5723 1.0361 1.0359 1.0597 1.0603 1.0579 1.0579 1.1014 1.1008 1.1039 1.1029 1.0990 1.0991 1.1069 1.1069 1.0934 1.0736
irintensity: 0.2640 0.1439 0.4450 1.0926 0.0072 0.1823 0.6382 0.1044 0.2372 0.2651 0.2786 0.5771 1.0421 1.7465 0.7753 0.5855 1.8516 0.4885 1.7166 10.5607 0.8547 0.2968 0.2958 3.9046 3.8339 4.0910 6.5732 6.8358 9.8987 3.5062 27.0256 0.6440 19.2518 16.3907 8.2431 6.2229 26.9973 31.9427 52.4753 57.6721 5.3630 16.2630 25.2580 96.2735 73.4490 12.6459 99.1333 179.3614 13.0200 10.8380 49.0153 95.4854 131.2462 11.3610 47.5070 38.4487 12.3111 8.0947 284.1956 144.9899 60.1589 14.6947 4.4392 39.4261 100.6753 0.3667 0.2294 2.1165 1.2433 3.2908 50.8164 1.8271 0.5187 0.1657 1.0200 1.0369 0.6787 17.9176 141.0936 8.5010 2.8031 18.3520 13.3395 107.2430 54.6164 6.2549 0.9588 5.3329 6.1829 7.1643 12.6888 15.3317 15.9648 41.5544 38.0238 31.6588 32.4064 0.6982 1.8840 52.6623 48.5276 0.4729 1.3201 7.0679 16.9012 33.8612 30.2812 50.4849 66.6004 3.3075 50.9631
temp: 298.150 k
press: 1.00000 atm
elementType: 17 17 17 17 17 15 8 8 8 7 7 6 6 6 6 6 6 6 6 6 6 6 6 1 1 1 1 1 1 1 1 1 1 1 1 1 1 1 1
symmnumber: 1
zpe: 713602.9 jmol-1
zpe.correction: 0.271797 hartree
zpe.thermalcorrener: 0.298524 hartree
zpe.thermalcorrenthalpy: 0.299468 hartree
zpe.thermalcorrgfe: 0.211782 hartree
zpe.sumelectzpe: -3441.756853 hartree
zpe.sumelectthermal: -3441.730126 hartree
zpe.sumelectthermalent: -3441.729182 hartree
zpe.sumelectthermalfe: -3441.816867 hartree
dipole: -0.7376 -1.2929 -0.6473
dipole: 1.6231
quadrupole: -200.5807 -175.1083 -164.5824
quadrupole: 17.8503 3.3622 -2.9375
quadrupole: -20.4902 4.9822 15.5080 17.8503 3.3622 -2.9375
hfenergy: -3442.0286499 hartree
pointgroup: C01 [X(C12H16Cl5N2O3P1)]
dipole: 0.4053155 -0.0949492 -0.4842558 debye
polarizability: 248.828891|-19.6456459|222.8414981|-16.6162304|-26.7042891|225.7469427 unknown
InChI: InChI=1S/C12H16Cl5N2O3P/c1-3-5-21-23(20,22-6-4-2)19-10-8(13)7-18-11(9(10)14)12(15,16)17/h7,19H,3-6H2,1-2H3
charge 0 multiplicity 1
39 atoms
Cl 0.512463 0.360373 -2.067112
Cl -1.312384 -2.879826 2.077502
Cl -2.381392 1.523975 -3.318702
Cl -3.829173 2.768677 -1.002082
Cl -0.895191 3.284947 -1.317819
P  2.320595 -1.259544 0.830574
O  2.160696 0.428347 0.552308
O  3.496765 -1.946629 -0.211013
O  2.611006 -1.680222 2.332376
N  0.780506 -1.808513 0.112042
N  -2.886043 0.351803 0.196173
C  2.688049 1.390132 1.577288
C  3.478138 -1.763434 -1.695221
C  -0.43048 -1.080096 0.113725
C  1.534978 2.269427 2.068934
C  4.212454 -0.485877 -2.119079
C  -0.690447 0.011738 -0.771754
C  -1.503539 -1.455524 0.973769
C  2.051538 3.38401 3.00768
C  4.298102 -0.386242 -3.6593
C  -1.909175 0.742102 -0.665146
C  -2.712341 -0.740868 0.977001
C  -2.234996 1.982213 -1.503687
H  0.649226 -2.815943 0.277331
H  3.456978 1.985096 1.053633
H  3.152135 0.826358 2.408865
H  2.431319 -1.770794 -2.053347
H  3.997926 -2.66646 -2.060137
H  1.023355 2.71443 1.19521
H  0.795093 1.639362 2.597552
H  3.680506 0.392775 -1.710044
H  5.227755 -0.494285 -1.680537
H  2.771701 4.043942 2.488982
H  1.214663 4.011672 3.360546
H  2.555393 2.962543 3.897313
H  3.291955 -0.360608 -4.118648
H  4.826886 0.534869 -3.961215
H  4.845987 -1.245243 -4.089976
H  -3.543108 -1.030182 1.626715
