program: Gaussian 09
title: 000196296
version: EM64L-G09RevD.01
frameworkgroup: C1[X(C12H12N6)]
method: RPBEPBE
basis: SDD
operation: Freq
keyword: #pfreq=noraman
keyword: PBEPBE/SDD
title: #p freq=noraman PBEPBE/SDD
converged: YES YES NO NO
title: Mulliken charges:
elementType: N N N N N N C C C C C C C C C C C C H H H H H H H H H H H H
charge: 0.033400 0.025971 0.008281 -0.017592 0.022852 -0.027612 -0.414384 -0.449311 -0.144398 -0.123866 -0.291846 -0.259846 -0.302843 -0.232198 -0.141080 -0.144822 -0.156768 -0.100936 0.225259 0.231352 0.213461 0.221614 0.232594 0.234765 0.228935 0.225115 0.229779 0.231516 0.220411 0.222199
chargesum: 0.00000
title: Mulliken charges with hydrogens summed into heavy atoms:
elementType: N N N N N N C C C C C C C C C C C C
charge: 0.033400 0.025971 0.008281 -0.017592 0.022852 -0.027612 0.042228 -0.014236 -0.144398 -0.123866 -0.059252 -0.025081 -0.073908 -0.007083 0.088699 0.086693 0.063643 0.121262
polarizability: 2.01706899e+02 4.67546621e+00 1.93998349e+02 -4.39955637e-01 8.88422251e-01 1.23226032e+02
1716.lowfreq: -9.0741 -6.1646 -0.0004 0.0004 0.0006 6.1162 15.9286 30.0239 35.6020
frequency: 15.0380 29.9731 35.5691 62.5504 75.7119 119.0809 121.7341 195.0284 208.1986 254.3111 273.1021 292.2859 295.8883 348.2905 369.0787 379.8348 439.1797 450.5221 491.0086 505.3010 518.2139 590.3659 594.7061 617.7715 620.3080 713.8827 727.1985 743.7715 748.7714 800.9582 805.9577 876.7878 885.1455 891.8942 894.4898 914.0725 923.7287 930.4203 933.3454 964.5652 966.9530 987.2298 988.5246 993.0799 998.8420 1043.0813 1056.2003 1070.3104 1100.0806 1118.9200 1198.3705 1206.4012 1215.7446 1260.3273 1328.7219 1351.0880 1369.7834 1372.5221 1376.4086 1377.4617 1407.0208 1409.7465 1438.0024 1468.5825 1514.9463 1522.3002 1561.4729 1570.6182 1603.1203 1605.5331 1631.3042 1635.6203 2959.6778 2974.2469 3023.0323 3041.6333 3077.4928 3079.4791 3081.4698 3083.6937 3113.9096 3115.7153 3142.5976 3144.7495
redmass: 5.2289 5.8997 5.1517 5.5448 5.1817 4.4417 5.6701 3.9331 3.9471 3.7933 4.7589 3.1777 3.8461 3.4287 8.3660 7.3280 4.6890 4.6481 4.2336 3.7336 2.8979 3.2239 3.3085 5.6533 5.1867 4.8342 4.3099 1.6740 1.7314 4.2976 5.3853 3.2929 2.8516 2.9301 3.2559 2.5330 2.8721 1.9121 1.9162 1.8101 1.6679 1.5131 2.1965 2.4246 1.5040 3.3790 3.7935 2.2799 3.6149 3.1248 1.0981 1.1010 1.1705 1.1273 1.2886 1.2771 1.2304 1.2303 1.2517 1.2454 1.6737 1.6498 1.0870 1.0940 11.3333 10.9863 9.7805 9.9098 5.2462 5.3165 10.4685 10.8410 1.0574 1.0598 1.1004 1.1042 1.0872 1.0871 1.0886 1.0883 1.0877 1.0874 1.0979 1.0976
irintensity: 0.9523 2.7818 2.5036 7.0263 4.4591 0.3641 3.5710 3.6976 2.3391 0.8787 7.5781 5.5986 20.2761 2.0875 12.3830 2.1992 9.4763 6.8610 2.7727 10.0967 28.2781 2.3477 2.2132 1.2311 4.4014 8.8058 4.0021 32.7713 30.8683 39.9579 36.6122 7.8887 1.8578 16.0401 17.5752 16.8224 18.7571 3.3961 1.4699 0.4077 1.5129 0.3967 0.3553 0.3220 0.8015 4.4279 19.2949 11.4280 30.9584 39.5110 2.9436 3.1148 2.2814 0.6248 17.2744 32.9074 1.6943 2.1572 3.8043 1.8621 22.6240 22.8999 27.9909 19.0777 25.5012 24.2771 0.1541 0.3579 15.7715 16.2883 281.4931 195.8266 21.3406 74.1940 31.0974 28.4785 31.4647 29.4108 14.7111 18.0245 16.5828 11.1510 31.6055 26.3541
temp: 298.150 k
press: 1.00000 atm
elementType: 7 7 7 7 7 7 6 6 6 6 6 6 6 6 6 6 6 6 1 1 1 1 1 1 1 1 1 1 1 1
symmnumber: 1
zpe: 593611.3 jmol-1
zpe.correction: 0.226095 hartree
zpe.thermalcorrener: 0.241851 hartree
zpe.thermalcorrenthalpy: 0.242795 hartree
zpe.thermalcorrgfe: 0.180272 hartree
zpe.sumelectzpe: -791.553692 hartree
zpe.sumelectthermal: -791.537936 hartree
zpe.sumelectthermalent: -791.536992 hartree
zpe.sumelectthermalfe: -791.599515 hartree
dipole: -6.9697 -4.9761 -1.4140
dipole: 8.6797
quadrupole: -95.2564 -90.5993 -106.6024
quadrupole: -8.0685 10.0264 3.0986
quadrupole: 2.2296 6.8867 -9.1164 -8.0685 10.0264 3.0986
hfenergy: -791.779787 hartree
pointgroup: C01 [X(C12H12N6)]
dipole: -2.3844444 -2.4407304 0.1358784 debye
polarizability: 199.809163|4.8022491|191.4829419|-4.2498749|-17.1456901|127.6391744 unknown
InChI: InChI=1S/C12H12N6/c1-2-6-14-11(13-5-1)17-9-10-18-12-15-7-3-4-8-16-12/h1-8H,9-10H2
charge 0 multiplicity 1
30 atoms
N  -0.46762 0.765267 -0.011521
N  1.986494 2.031063 -1.178714
N  -1.435948 -0.938151 1.282074
N  -2.822831 0.927254 0.49574
N  3.808462 0.542951 -1.095777
N  2.680015 1.160187 0.973343
C  -0.47045 2.03862 -0.761092
C  0.875788 2.776418 -0.556122
C  -1.547023 0.274818 0.507899
C  2.734677 1.255277 -0.4552
C  -2.172909 -1.984588 0.966821
C  -3.88606 0.344438 -0.020885
C  3.845362 -0.771796 -1.013355
C  2.410965 0.009283 1.552304
C  -3.240214 -2.092455 -0.034247
C  -4.018386 -1.040383 -0.480884
C  2.973984 -1.663758 -0.240472
C  2.315529 -1.308176 0.921412
H  -1.309076 2.703035 -0.46594
H  -0.576139 1.811478 -1.840794
H  0.799677 3.749335 -1.077646
H  1.025012 2.958786 0.527183
H  -1.976032 -2.895471 1.553216
H  -4.793868 0.964316 -0.082971
H  4.65005 -1.258704 -1.586102
H  2.267349 0.036666 2.64326
H  -3.515895 -3.110649 -0.337539
H  -4.880237 -1.260996 -1.123475
H  2.957964 -2.71619 -0.552677
H  1.781061 -2.079977 1.488661
