program: Gaussian 09
title: 000188000
version: EM64L-G09RevD.01
frameworkgroup: C1[X(C18H12Cl2)]
method: RPBEPBE
basis: SDD
operation: Freq
keyword: #p
keyword: freq=noraman
keyword: PBEPBE/SDD
title: #p freq=noraman PBEPBE/SDD
converged: NO YES NO NO
title: Mulliken charges:
elementType: Cl Cl C C C C C C C C C C C C C C C C C C H H H H H H H H H H H H
charge: -0.034985 -0.045152 0.281682 0.266153 0.371603 0.265551 -0.352713 -0.352714 -0.368604 -0.368604 -0.298589 -0.348415 -0.385503 -0.383345 -0.205216 -0.225125 -0.218480 -0.218239 -0.097549 -0.239506 0.244208 0.244209 0.247383 0.247382 0.257618 0.243295 0.246203 0.282496 0.260748 0.227103 0.227660 0.229443
chargesum: 0.00000
title: Mulliken charges with hydrogens summed into heavy atoms:
elementType: Cl Cl C C C C C C C C C C C C C C C C C C
charge: -0.034985 -0.045152 0.281682 0.266153 0.371603 0.265551 -0.108505 -0.108506 -0.121221 -0.121222 -0.298589 -0.090797 -0.142207 -0.137141 0.077280 0.035623 0.008623 0.009421 -0.097549 -0.010063
polarizability: 3.37426431e+02 1.22298614e+01 1.81062561e+02 3.43105704e-03 2.02489850e-03 1.17847773e+02
1716.lowfreq: -70.4131 -29.5457 -3.7405 -1.7173 -0.0024 -0.0021 -0.0018 7.5140 25.7806
frequency: -70.4125 -29.5077 25.7582 34.0156 79.2007 84.7957 151.1044 158.4237 168.6080 197.8850 212.0477 289.2129 336.2006 342.7585 375.8308 379.1121 393.6805 397.5521 456.4457 469.4042 491.3240 534.2542 561.6890 576.4370 616.5186 630.3288 635.2194 665.5414 705.4102 723.6399 735.2727 749.0141 769.5062 781.8548 823.3517 840.0465 848.2595 853.1861 865.7159 919.5932 953.5334 956.7832 971.7489 973.5412 985.3719 987.0555 994.8854 995.4524 1021.1197 1040.2096 1062.5223 1076.6335 1081.3860 1109.5476 1136.3517 1171.9603 1186.6456 1191.1714 1239.1401 1282.5869 1290.7712 1297.7653 1309.3237 1338.6033 1339.8531 1367.8483 1372.6436 1394.0392 1427.7158 1452.1315 1476.3138 1513.9267 1558.0610 1559.5848 1582.9926 1592.0710 1610.6153 1623.4993 3121.8792 3127.7309 3129.5606 3130.6970 3139.7584 3148.8703 3149.5076 3150.0354 3155.6422 3163.8420 3177.0447 3181.3396
redmass: 3.7856 4.5395 7.5737 8.6003 5.4045 6.8111 11.5080 5.4026 6.7980 11.9232 6.3699 4.1835 7.5131 6.1519 11.4752 4.5310 2.8798 2.8273 3.9071 5.2576 7.7704 3.3583 3.9303 2.8019 5.7134 6.1911 7.2259 6.8967 1.7481 3.9260 6.9776 4.1114 1.9567 7.1061 1.3970 1.6103 1.2443 1.2388 1.4102 1.4029 1.3523 1.3369 1.3766 1.3806 7.2978 6.3608 1.3083 6.9643 2.6965 2.0752 2.4758 1.6031 2.4853 1.4070 1.4053 1.0530 1.1153 1.1090 1.4383 2.0642 3.3430 1.2664 1.3725 5.4836 4.5856 6.7179 4.6864 3.3856 2.2098 2.4403 2.3922 3.3223 7.2292 8.4886 6.0045 7.4145 6.2310 6.7049 1.0844 1.0877 1.0877 1.0878 1.0925 1.0968 1.0895 1.0966 1.0978 1.1018 1.0960 1.0940
irintensity: 0.0011 0.0943 0.0767 0.0025 0.5252 0.0553 0.5592 0.0382 0.0002 0.5815 0.0930 0.3590 3.7179 1.7077 2.7001 0.1409 0.0019 0.0000 8.8011 0.8854 10.1600 16.8566 6.7092 28.8835 1.5666 0.0264 8.5219 9.2014 51.2402 2.8998 18.4880 0.1246 49.8283 42.5251 32.5616 41.1375 0.3334 0.0660 20.0608 1.5502 0.0642 0.1432 0.0324 0.0038 41.9018 7.1368 0.1172 25.8238 3.3373 6.7407 14.7961 7.8798 37.3238 7.3587 2.7398 0.0208 1.7365 0.0416 0.6012 0.0758 0.6959 0.0003 0.6633 1.4637 13.1952 0.1113 7.6430 4.8866 7.2249 162.2060 4.4981 1.2832 0.0003 25.5289 1.5678 38.1619 5.0916 0.8595 2.5732 0.2382 0.0070 18.2227 18.0135 37.8259 4.1627 23.2090 0.0370 26.1674 1.5269 1.2373
temp: 298.150 k
press: 1.00000 atm
elementType: 17 17 6 6 6 6 6 6 6 6 6 6 6 6 6 6 6 6 6 6 1 1 1 1 1 1 1 1 1 1 1 1
symmnumber: 1
zpe: 623131.9 jmol-1
zpe.correction: 0.237338 hartree
zpe.thermalcorrener: 0.252459 hartree
zpe.thermalcorrenthalpy: 0.253403 hartree
zpe.thermalcorrgfe: 0.193185 hartree
zpe.sumelectzpe: -1611.882493 hartree
zpe.sumelectthermal: -1611.867373 hartree
zpe.sumelectthermalent: -1611.866429 hartree
zpe.sumelectthermalfe: -1611.926647 hartree
dipole: 1.8654 -1.4866 0.0002
dipole: 2.3853
quadrupole: -126.6756 -122.7679 -129.1244
quadrupole: 1.6962 -0.0001 0.0010
quadrupole: -0.4863 3.4214 -2.9351 1.6962 -0.0001 0.0010
hfenergy: -1612.1198318 hartree
pointgroup: C01 [X(C18H12Cl2)]
dipole: -0.7287121 0.5913145 0.0000611 debye
polarizability: 337.6296512|10.8513567|180.8593407|-0.0034488|-0.0019946|117.8477735 unknown
InChI: InChI=1S/C18H12Cl2/c19-16-10-11-17(18(20)12-16)15-8-6-14(7-9-15)13-4-2-1-3-5-13/h1-12H
charge 0 multiplicity 1
32 atoms
Cl 2.435389 -2.651709 -0.000258
Cl 7.068946 0.379064 -0.000118
C  0.914146 0.120016 -0.000018
C  -1.946658 0.090854 0.000039
C  2.413662 0.159033 -0.000045
C  -3.448541 0.06627 0.000069
C  0.191818 0.114571 -1.219739
C  0.191869 0.114432 1.219733
C  -1.220177 0.099776 -1.21869
C  -1.220127 0.099636 1.218739
C  3.21915 -1.006856 -0.00015
C  3.094112 1.406278 0.000038
C  -4.193314 1.274795 -0.000047
C  -4.149036 -1.168486 0.000213
C  4.628413 -0.96297 -0.000173
C  4.503396 1.494204 0.000018
C  -5.606878 1.249653 -0.000018
C  -5.562518 -1.194183 0.000241
C  5.24881 0.299885 -0.000088
C  -6.296106 0.014836 0.000125
H  0.736736 0.116161 -2.170466
H  0.736826 0.115914 2.170437
H  -1.766257 0.092665 -2.168667
H  -1.766168 0.092421 2.168738
H  2.497872 2.324698 0.000123
H  -3.661238 2.233136 -0.000158
H  -3.582322 -2.106682 0.000302
H  5.217463 -1.88327 -0.000256
H  5.005359 2.465439 0.000084
H  -6.1678 2.191218 -0.000107
H  -6.088918 -2.155437 0.000351
H  -7.391808 -0.005061 0.000147
