program: Gaussian 09
title: 000196324
version: EM64L-G09RevD.01
frameworkgroup: C1[X(C10H15N2O9PS)]
method: RPBEPBE
basis: SDD
operation: Freq
keyword: #p
keyword: freq=noraman
keyword: PBEPBE/SDD
title: #p freq=noraman PBEPBE/SDD
converged: YES YES NO NO
title: Mulliken charges:
elementType: S P O O O O O O O O O N N C C C C C C C C C C H H H H H H H H H H H H H H H
charge: 0.173899 1.411652 -0.281875 -0.442597 -0.465911 -0.509795 -0.316956 -0.751163 -0.669588 -0.231893 -0.575251 -0.179095 -0.400505 -0.146653 -0.194742 -0.028296 -0.062326 -0.294258 -0.097429 0.258075 -0.293253 0.198452 -0.826423 0.232659 0.244807 0.296933 0.287111 0.237470 0.237244 0.377964 0.397471 0.407670 0.368415 0.403928 0.396650 0.268573 0.309614 0.259422
chargesum: 0.00000
title: Mulliken charges with hydrogens summed into heavy atoms:
elementType: S P O O O O O O O O O N N C C C C C C C C C C
charge: 0.173899 1.411652 -0.281875 -0.064632 -0.068440 -0.509795 -0.316956 -0.347235 -0.272938 -0.231893 -0.575251 -0.179095 -0.032090 0.086006 0.050065 0.268636 0.224785 0.180456 0.310240 0.258075 -0.293253 0.198452 0.011186
polarizability: 2.24734303e+02 1.11984079e+01 2.49443129e+02 -2.89754171e+00 2.90143687e+00 1.23399146e+02
1716.lowfreq: -10.8770 -6.1229 -2.8717 -0.0017 -0.0013 0.0012 22.7384 35.8145 46.4962
frequency: 22.6997 35.7660 46.3871 54.6889 65.9749 79.8578 83.3770 98.7708 116.9876 137.2108 149.7501 168.6170 171.6551 179.4440 183.0234 206.1293 233.1677 252.7490 266.2373 282.9330 289.6525 295.7947 310.2689 322.7145 346.3081 357.2920 365.8269 377.3767 395.3681 416.1248 426.9928 435.0958 481.1608 530.8188 537.0732 543.9503 570.4445 605.7871 625.1685 633.2953 638.7890 678.3831 698.3188 705.4245 718.9027 720.8563 725.7397 742.5873 759.4320 782.9387 801.1722 868.0317 890.8593 938.8199 968.1835 976.4664 983.6864 992.3510 996.3546 1003.1158 1006.3227 1022.4334 1024.4413 1038.6136 1063.3987 1067.1264 1091.6178 1097.7021 1108.8688 1172.9645 1190.9755 1220.3711 1228.4193 1254.0418 1257.8393 1269.0127 1309.7190 1320.9963 1325.7156 1335.7587 1338.6169 1353.7085 1361.4782 1365.2167 1378.5129 1391.3152 1402.9945 1444.3878 1449.1414 1467.1060 1585.3818 1619.8749 1644.4257 2973.9786 2990.7021 3003.2982 3019.9506 3020.1123 3067.5667 3084.8845 3115.6142 3147.0419 3156.6589 3319.0289 3356.4122 3438.2852 3516.5395 3591.4645
redmass: 8.3039 6.5367 6.5735 4.2861 8.6151 6.7213 9.5452 6.5225 6.0004 6.4955 6.2900 3.0023 1.3052 5.2216 8.1182 6.5316 7.6583 3.8073 4.3456 5.8321 6.0949 5.4194 5.6743 6.6725 3.1908 7.1885 2.5809 6.3643 5.6630 5.0673 6.0214 3.8865 2.3041 2.5769 2.0020 1.1524 6.9946 7.2609 5.8486 8.0357 7.5705 3.5590 1.5823 1.8188 6.1118 5.5528 4.9593 7.9293 7.0956 2.4725 4.1672 4.1883 3.5983 2.7074 1.6740 2.1244 1.2349 2.7893 1.5908 1.3754 1.6365 1.7647 4.2222 6.5455 3.8310 4.4754 3.0093 6.1858 4.3963 4.0297 1.5017 1.1693 1.2275 1.2685 1.9033 1.1713 1.2951 1.6040 1.1978 1.5235 1.2277 1.3912 1.4278 1.5611 1.7879 1.5850 2.8099 1.0533 1.0819 1.0560 5.2316 9.6555 5.9916 1.0840 1.0815 1.0622 1.0823 1.0307 1.1017 1.0932 1.0969 1.1046 1.1070 1.0665 1.0690 1.0643 1.0772 1.0662
irintensity: 2.0153 4.6058 0.2594 0.6164 2.3113 1.9519 1.3409 1.1862 1.6412 3.1855 0.9519 0.2006 0.5758 0.5982 5.1343 6.9665 15.7682 21.3663 10.3805 19.5412 35.5994 5.7739 5.3571 1.5574 69.2520 35.1379 80.0903 17.2412 13.4510 16.1482 12.9312 5.1448 48.5313 61.0838 94.6904 63.0441 6.7395 5.0000 5.8079 26.4630 14.3769 90.7351 43.2116 15.8372 101.2481 74.6066 39.1363 327.2008 12.2185 141.9939 36.5883 2.4889 10.2690 51.2552 344.5124 40.6988 90.3282 70.9203 3.2049 22.0057 11.2739 7.7678 51.7308 91.3713 63.4039 57.5513 33.1135 211.7670 53.9773 16.9934 16.6284 70.8149 42.9680 15.2008 107.2719 0.2265 18.4884 39.3619 46.3248 87.4305 28.3604 4.4543 36.7105 7.1088 13.6613 154.5455 185.6759 21.3426 8.6476 20.2714 69.3343 266.6338 680.9798 9.9082 42.6307 45.4617 16.2639 23.1350 6.2321 18.0082 140.6068 7.8123 2.7370 250.8025 797.1808 47.0718 71.3880 72.0558
temp: 298.150 k
press: 1.00000 atm
elementType: 16 15 8 8 8 8 8 8 8 8 8 7 7 6 6 6 6 6 6 6 6 6 6 1 1 1 1 1 1 1 1 1 1 1 1 1 1 1
symmnumber: 1
zpe: 707605.4 jmol-1
zpe.correction: 0.269513 hartree
zpe.thermalcorrener: 0.293434 hartree
zpe.thermalcorrenthalpy: 0.294378 hartree
zpe.thermalcorrgfe: 0.215474 hartree
zpe.sumelectzpe: -1914.098897 hartree
zpe.sumelectthermal: -1914.074976 hartree
zpe.sumelectthermalent: -1914.074032 hartree
zpe.sumelectthermalfe: -1914.152936 hartree
dipole: -0.7861 -0.3597 2.6509
dipole: 2.7883
quadrupole: -162.4606 -156.2307 -151.0224
quadrupole: 0.3348 24.0558 0.6188
quadrupole: -5.8894 0.3405 5.5489 0.3348 24.0558 0.6188
hfenergy: -1914.3684099 hartree
pointgroup: C01 [X(C10H15N2O9P1S1)]
dipole: -0.2364241 -0.2871117 1.0320151 debye
polarizability: 220.6557091|-2.1711442|253.4409678|-2.4573753|4.9553205|123.4799007 unknown
InChI: InChI=1S/C10H15N2O9PS/c1-23-5-2-12(10(16)11-8(5)15)9-7(14)6(13)4(21-9)3-20-22(17,18)19/h2,4,6-7,9,11,13-14,17-18H,3H2,1H3
charge 0 multiplicity 1
38 atoms
S  0.055463 -3.563037 0.287822
P  3.948451 -0.783592 0.048845
O  0.752057 1.404666 -0.989196
O  0.484629 4.475822 -0.4251
O  -1.711456 3.49925 0.655187
O  3.604245 0.8834 -0.131476
O  -3.306063 1.344464 0.02478
O  2.37784 -1.404355 -0.136716
O  4.145239 -1.047733 1.754198
O  -3.13465 -3.320563 0.38598
O  5.135378 -1.286823 -0.861251
N  -1.241011 0.273467 -0.291076
N  -3.17234 -0.994556 0.150069
C  0.712808 3.348226 0.465946
C  -0.610815 2.557315 0.651697
C  1.651716 2.348256 -0.245212
C  -0.622292 1.613821 -0.590159
C  2.583968 1.577356 0.695186
C  -0.480403 -0.887294 -0.258364
C  -2.623431 0.27073 -0.036427
C  -1.032737 -2.118541 0.02408
C  -2.482339 -2.256835 0.204854
C  -0.496121 -4.697908 -1.124931
H  1.116804 3.694618 1.438121
H  -0.582319 1.95269 1.581715
H  2.248511 2.875734 -1.007265
H  -1.203801 2.070888 -1.413827
H  2.035005 0.858768 1.331444
H  3.138287 2.28851 1.334615
H  -0.458744 4.765303 -0.266732
H  -2.547267 2.974635 0.464506
H  0.589763 -0.755047 -0.452864
H  -4.184623 -1.027732 0.313716
H  2.151323 -2.366665 0.025621
H  5.091157 -1.104651 2.045658
H  -0.274841 -4.227973 -2.093916
H  -1.571259 -4.888627 -1.001058
H  0.075868 -5.630885 -1.006268
