program: Gaussian 09
title: 000196398
version: EM64L-G09RevD.01
frameworkgroup: C1[X(C24H26N2O4)]
method: RPBEPBE
basis: SDD
operation: Freq
keyword: #p
keyword: freq=noraman
keyword: PBEPBE/SDD
title: #p freq=noraman PBEPBE/SDD
converged: YES YES NO NO
title: Mulliken charges:
elementType: O O O O N N C C C C C C C C C C C C C C C C C C C C C C C C H H H H H H H H H H H H H H H H H H H H H H H H H H
charge: -0.199672 -0.189843 -0.301260 -0.300379 -0.118787 -0.320182 0.274446 -0.564124 -0.141565 -0.454041 -0.414579 -0.627212 0.105167 0.311807 -0.389364 -0.552799 0.316766 0.148504 -0.535555 -0.559080 0.470985 0.169957 0.193708 -0.350009 -0.345121 -0.221695 -0.222078 -0.240707 -0.530637 -0.530337 0.239951 0.214262 0.260804 0.207122 0.223592 0.213336 0.224340 0.272736 0.263032 0.199547 0.212123 0.212890 0.232552 0.248482 0.257466 0.268463 0.269633 0.230219 0.229689 0.231061 0.227956 0.222006 0.253087 0.227971 0.221275 0.254092
chargesum: 0.00000
title: Mulliken charges with hydrogens summed into heavy atoms:
elementType: O O O O N N C C C C C C C C C C C C C C C C C C C C C C C C
charge: -0.199672 -0.189843 -0.301260 -0.300379 -0.118787 -0.320182 0.274446 -0.109911 0.119239 -0.023327 0.023097 -0.091445 0.105167 0.311807 0.022306 -0.107357 0.316766 0.148504 -0.287073 -0.301614 0.470985 0.169957 0.193708 -0.081547 -0.075488 0.008524 0.007611 -0.009646 0.172412 0.173000
polarizability: 3.77797096e+02 -2.40307965e+00 2.66497751e+02 -4.88252674e+00 1.11122184e+01 2.13354201e+02
1716.lowfreq: -5.1414 -3.7107 -0.0010 0.0003 0.0008 7.6282 13.7959 25.6521 30.1784
frequency: 12.4261 25.6277 30.1762 50.0867 60.4556 61.5300 76.1800 88.0343 106.4375 106.7863 133.5461 152.0612 160.0083 167.6607 175.3039 187.0458 196.7736 210.2058 241.6279 253.3397 273.0126 277.9494 283.9778 290.7839 300.5344 317.5983 330.3185 354.9024 389.0252 399.8621 404.4806 418.9789 429.4848 449.8461 480.2896 491.5560 498.0019 500.5992 525.9071 540.7568 570.3651 594.2467 598.4794 613.3451 626.6117 669.3250 679.3413 684.1495 692.8057 705.7205 718.4616 726.9635 740.7749 743.6224 765.6245 802.9092 810.6133 836.7278 864.2404 876.9879 885.7849 891.0611 908.8159 913.8556 932.5877 937.6654 956.7368 968.6988 969.5203 988.5908 990.7345 993.9386 1008.7386 1016.4135 1029.5954 1035.1275 1061.5499 1072.6716 1080.3999 1096.5122 1109.9150 1113.5699 1116.0626 1126.2281 1133.3846 1147.2419 1150.2310 1152.7908 1156.9873 1167.1574 1172.0483 1175.2892 1177.1725 1193.8802 1195.4812 1210.3621 1219.0889 1243.0486 1244.4216 1255.1099 1271.3330 1277.2086 1298.0123 1313.7799 1320.2987 1326.4221 1327.7349 1328.2908 1334.9426 1343.7663 1354.6052 1369.1572 1383.9644 1386.4464 1397.5589 1425.0342 1438.9009 1442.5735 1443.7329 1444.4731 1444.8208 1450.9610 1457.7575 1459.4444 1466.5540 1477.9105 1482.0878 1486.0971 1487.4973 1490.3439 1568.5012 1593.7564 1610.3858 1618.2963 1620.4261 1685.0250 2860.8359 2867.4380 2893.0891 2969.3479 2971.0654 2979.3844 2982.6851 2991.3470 3006.7330 3025.3291 3032.0547 3036.6081 3047.5482 3057.8610 3065.5262 3067.0987 3076.2464 3118.7361 3119.2283 3132.3792 3138.6458 3145.1095 3145.3107 3162.8322 3187.7068 3191.9532
redmass: 5.6832 4.7475 4.9320 4.1595 4.6289 4.9476 3.7498 4.1926 2.7265 4.6982 4.3536 1.5523 2.7553 1.3367 2.7573 2.8280 3.0560 2.9137 3.3022 2.8848 4.6664 5.7982 3.0920 4.7940 5.1848 3.3218 2.5614 3.7028 4.4857 4.2387 2.8276 3.6060 4.8349 5.4581 3.4976 3.0113 4.2236 3.3885 2.5763 4.4727 3.5955 4.2148 7.7757 6.2138 4.2855 4.4334 5.7442 5.6852 1.9226 4.1428 4.8517 5.2045 3.2704 2.8568 1.8963 2.9428 2.8658 1.2554 2.7297 2.0687 1.8335 1.9852 2.0542 1.4437 2.6552 3.1935 5.7186 2.4741 1.3998 3.3101 5.2050 1.4019 2.0983 2.3654 2.1907 2.4007 2.3411 2.6213 3.0942 2.0039 2.3214 1.2436 1.2440 3.0904 2.2941 2.3404 1.5093 1.8993 1.8989 3.1803 1.5986 1.0532 1.9114 1.3838 1.1993 1.4458 1.6662 1.5529 1.3395 1.6149 1.7724 2.6687 1.5055 1.9901 1.7442 2.3650 1.3503 1.4292 1.4927 1.5059 1.5788 5.2273 9.2840 1.9568 1.8491 1.1725 1.1059 1.6252 1.1107 1.3759 1.2955 1.1014 1.0563 1.0612 1.0859 1.0550 1.1118 2.2923 1.0676 3.0130 8.6732 6.4267 6.0360 7.3865 10.6171 12.3602 1.0725 1.0777 1.0695 1.0309 1.0312 1.0603 1.0597 1.0600 1.0639 1.0901 1.0893 1.1001 1.1034 1.1020 1.1035 1.1037 1.0983 1.1027 1.1026 1.0855 1.0913 1.0908 1.0908 1.0972 1.0948 1.0965
irintensity: 0.0031 0.0786 0.3283 0.1595 3.0642 1.0840 4.1890 1.7111 6.1370 3.0734 1.8384 1.3294 1.6709 1.0828 4.1257 3.0564 1.0503 4.4813 3.0977 3.1748 5.3852 3.4710 4.9386 1.2004 7.0272 6.8186 2.4781 1.9176 0.6484 2.1152 0.3717 4.2587 5.7785 8.1424 1.7296 2.7957 2.1611 7.1721 3.8264 7.0807 0.9360 25.9732 14.7558 0.4585 9.7892 3.4842 15.7376 2.8762 48.9688 2.3926 9.2802 0.9073 7.7480 8.9278 59.0491 5.0329 18.7358 0.0325 8.2422 6.5824 6.6903 0.4981 41.4564 3.5472 0.5872 24.6992 96.7150 26.0332 0.1139 12.8865 0.3147 2.2625 14.6659 1.8909 4.9434 5.1990 6.4707 30.6146 30.4059 17.1295 64.5482 10.8826 7.7047 59.4580 52.2228 89.0758 48.6749 18.1149 10.1122 59.7345 39.5852 0.1737 23.9884 2.1194 2.1411 11.7027 9.8613 9.4489 3.7883 8.1901 17.0994 124.5559 10.1838 83.2547 19.4358 212.4562 5.4654 3.5723 9.1576 11.9139 56.0014 3.8256 0.4954 6.8838 6.7415 0.0691 3.3206 14.6483 8.9553 2.9743 19.2724 6.3832 13.1363 7.5150 8.1460 6.4860 10.3447 96.4518 6.9709 188.0290 0.8275 27.3043 25.9540 51.2849 377.8205 43.7007 57.8098 36.0566 81.6822 92.5947 63.5306 31.2807 27.0049 15.6495 10.4864 16.8991 76.5279 37.0298 30.0443 20.1523 32.6457 22.3969 5.9304 26.2305 26.6783 0.0278 11.3079 3.8213 17.8225 35.2004 3.2740 0.9519
temp: 298.150 k
press: 1.00000 atm
elementType: 8 8 8 8 7 7 6 6 6 6 6 6 6 6 6 6 6 6 6 6 6 6 6 6 6 6 6 6 6 6 1 1 1 1 1 1 1 1 1 1 1 1 1 1 1 1 1 1 1 1 1 1 1 1 1 1
symmnumber: 1
zpe: 1189525.7 jmol-1
zpe.correction: 0.453066 hartree
zpe.thermalcorrener: 0.479922 hartree
zpe.thermalcorrenthalpy: 0.480866 hartree
zpe.thermalcorrgfe: 0.394711 hartree
zpe.sumelectzpe: -1338.360546 hartree
zpe.sumelectthermal: -1338.333691 hartree
zpe.sumelectthermalent: -1338.332746 hartree
zpe.sumelectthermalfe: -1338.418901 hartree
dipole: -1.2722 0.9257 -0.6015
dipole: 1.6844
quadrupole: -169.9857 -159.8170 -182.2418
quadrupole: 4.1680 -13.4997 4.5495
quadrupole: 0.6958 10.8645 -11.5603 4.1680 -13.4997 4.5495
hfenergy: -1338.8136122 hartree
pointgroup: C01 [X(C24H26N2O4)]
dipole: 0.5248168 0.3290203 0.235505 debye
polarizability: 377.4227119|-3.7745035|267.1539526|-8.9849067|-9.1916634|213.0723831 unknown
InChI: InChI=1S/C24H26N2O4/c1-29-20-12-16-8-10-25-11-9-24(14-19(25)18(16)13-21(20)30-2)15-22(27)26(23(24)28)17-6-4-3-5-7-17/h3-7,12-13,19H,8-11,14-15H2,1-2H3
charge 0 multiplicity 1
56 atoms
O  -1.850657 0.041691 1.327774
O  -4.379754 0.455519 -2.62025
O  4.023417 -2.951727 -0.692038
O  6.396657 -1.308102 -0.152263
N  1.064811 2.366621 0.590868
N  -3.396696 0.115742 -0.474069
C  -1.247238 1.173223 -0.82825
C  0.198843 0.608237 -0.905471
C  1.054941 0.894483 0.357919
C  -1.191572 2.668031 -0.367235
C  -0.299884 2.871195 0.870916
C  -2.002249 1.039143 -2.174969
C  -2.136414 0.38098 0.153819
C  2.4739 0.330653 0.216772
C  2.070599 2.774652 1.596906
C  3.474781 2.542829 1.014443
C  3.623261 1.111107 0.521043
C  -3.401342 0.531584 -1.843804
C  2.650153 -1.0229 -0.164204
C  4.909609 0.537604 0.37474
C  -4.524574 -0.496063 0.190856
C  3.928916 -1.596463 -0.286929
C  5.080985 -0.793626 -0.048532
C  -5.833581 -0.021013 -0.069821
C  -4.318059 -1.567012 1.094845
C  -6.933571 -0.623986 0.576337
C  -5.426803 -2.154752 1.740521
C  -6.736811 -1.689494 1.484377
C  4.631688 -3.848877 0.318182
C  6.777491 -1.747258 -1.515027
H  0.706176 1.079347 -1.76949
H  0.153962 -0.479943 -1.095518
H  0.5664 0.376243 1.221102
H  -2.21318 3.050189 -0.174537
H  -0.759648 3.252627 -1.202031
H  -0.230797 3.953279 1.0893
H  -0.756946 2.375788 1.761594
H  -1.520168 0.299475 -2.842098
H  -2.071601 1.9854 -2.736841
H  1.95771 2.213519 2.558846
H  1.922792 3.847439 1.819717
H  4.247532 2.763116 1.775751
H  3.626227 3.250433 0.176013
H  1.792556 -1.677262 -0.353402
H  5.80855 1.126929 0.588692
H  -5.989704 0.795149 -0.778609
H  -3.306612 -1.923477 1.300244
H  -7.944809 -0.257687 0.369074
H  -5.263718 -2.979865 2.442215
H  -7.594037 -2.152126 1.985451
H  4.677125 -4.840117 -0.158488
H  3.992391 -3.893863 1.220511
H  5.644442 -3.503745 0.59458
H  7.791314 -2.164583 -1.416194
H  6.792877 -0.880211 -2.202742
H  6.077114 -2.513075 -1.894496
