program: Gaussian 09
title: 000187986
version: EM64L-G09RevD.01
frameworkgroup: C1[X(C13H13IN2O2)]
method: RPBEPBE
basis: SDD
operation: Freq
keyword: #p
keyword: freq=noraman
keyword: PBEPBE/SDD
title: #p freq=noraman PBEPBE/SDD
converged: YES YES NO NO
title: Mulliken charges:
elementType: I O O N N C C C C C C C C C C C C C H H H H H H H H H H H H H
charge: 0.096750 -0.207895 -0.245639 -0.175299 -0.335043 -0.194610 -0.391815 -0.414435 -0.394148 -0.379336 0.141100 0.237672 0.456384 -0.332896 -0.334258 -0.158299 -0.155919 -0.367845 0.271531 0.212820 0.238076 0.234781 0.200425 0.224195 0.259384 0.214960 0.215852 0.291657 0.291901 0.249898 0.250053
chargesum: 0.00000
title: Mulliken charges with hydrogens summed into heavy atoms:
elementType: I O O N N C C C C C C C C C C C C C
charge: 0.096750 -0.207895 -0.245639 -0.175299 -0.335043 0.076921 0.059081 0.020771 0.089430 0.051476 0.141100 0.237672 0.456384 -0.041239 -0.042358 0.091599 0.094133 -0.367845
polarizability: 3.05091358e+02 7.67720318e+00 1.60401314e+02 -6.45788217e+00 5.76070997e+00 9.15523757e+01
1716.lowfreq: -3.0474 -0.0004 -0.0004 -0.0003 4.3908 17.0263 31.1694 35.9660 61.7556
frequency: 31.1001 35.8790 61.7197 80.2920 110.3241 130.5983 158.8897 181.9591 195.1447 245.4755 258.5265 313.3052 328.4447 352.2607 357.2423 376.9961 404.4865 422.3026 470.3918 503.8230 514.3970 562.1630 608.2494 621.6946 652.8850 687.0557 701.0404 710.8946 747.2437 804.6398 822.9466 829.2357 834.9056 868.4706 875.4016 928.8585 953.1719 960.5587 966.7353 984.0539 997.8710 1036.1614 1062.0940 1073.1137 1080.5742 1112.9272 1125.2246 1130.9242 1148.6692 1179.7138 1204.5542 1229.2624 1230.9103 1253.6128 1282.8760 1296.9945 1303.9268 1332.4290 1335.2927 1340.3127 1341.7670 1357.8820 1363.8785 1391.1413 1400.9423 1457.4791 1465.6467 1469.2607 1476.5722 1478.3143 1570.4567 1595.3147 1641.0348 1700.2181 2971.3452 2974.1409 2974.9688 2993.5630 3000.1762 3049.2579 3059.8125 3075.5108 3080.3193 3163.0056 3164.8294 3195.7849 3198.3525
redmass: 6.0809 3.9201 6.5803 5.9883 4.1543 6.1878 10.9874 6.7100 5.2984 2.2918 5.8881 2.1037 5.6047 6.5959 8.1181 4.5280 2.9332 3.6561 3.2843 2.9394 3.0824 4.0688 4.6452 7.1582 6.9981 4.2428 5.9440 4.6480 4.9073 2.9103 1.2534 1.5637 1.6180 3.1271 2.2103 1.8814 1.4076 2.1180 1.3870 4.7235 3.7226 3.6780 2.3727 3.2805 1.6663 2.5821 1.6007 1.4899 1.6462 2.3393 1.1671 1.5442 1.6337 1.3576 1.7818 1.5377 1.2796 1.3838 1.3829 5.0966 1.4396 1.4018 7.3592 3.1491 2.9158 1.0914 1.0867 1.0874 2.3410 1.1050 7.6251 5.7971 11.4520 11.7068 1.0781 1.0711 1.0673 1.0610 1.0630 1.0964 1.1013 1.1018 1.0972 1.0912 1.0908 1.0944 1.0956
irintensity: 1.5469 0.3742 1.5123 0.2911 0.2802 4.6457 0.1120 1.1686 2.1597 3.6666 0.9420 0.0527 1.3223 8.6892 29.8888 0.6635 2.3017 5.0704 0.4781 18.7592 18.1746 13.9100 8.8208 0.1708 2.8055 2.0212 7.4057 7.2851 16.6404 12.9373 0.2271 57.8474 24.2832 4.9791 26.0425 0.5241 5.6225 7.5502 0.1008 68.2660 5.1999 31.6471 14.5015 58.8594 4.2007 2.5979 16.4950 28.5506 25.1918 19.5846 1.8342 67.1532 25.6319 2.6802 86.7921 79.2092 2.1457 21.4078 8.4275 220.8982 1.9194 5.0109 0.2669 206.8258 32.2547 6.3230 18.6289 14.0527 247.7754 15.3465 3.9209 0.7572 452.5100 162.1374 16.7396 21.0027 62.0602 27.4277 15.9223 46.3543 48.9304 28.5461 12.5316 4.9963 1.8107 1.0317 2.9106
temp: 298.150 k
press: 1.00000 atm
elementType: 53 8 8 7 7 6 6 6 6 6 6 6 6 6 6 6 6 6 1 1 1 1 1 1 1 1 1 1 1 1 1
symmnumber: 1
zpe: 628172.2 jmol-1
zpe.correction: 0.239258 hartree
zpe.thermalcorrener: 0.254812 hartree
zpe.thermalcorrenthalpy: 0.255756 hartree
zpe.thermalcorrgfe: 0.193973 hartree
zpe.sumelectzpe: -773.381016 hartree
zpe.sumelectthermal: -773.365462 hartree
zpe.sumelectthermalent: -773.364518 hartree
zpe.sumelectthermalfe: -773.426301 hartree
dipole: 5.9030 0.0581 0.2036
dipole: 5.9068
quadrupole: -88.3751 -127.6893 -120.2451
quadrupole: -0.1872 0.4040 5.7966
quadrupole: 23.7281 -15.5861 -8.1419 -0.1872 0.4040 5.7966
hfenergy: -773.6202743 hartree
pointgroup: C01 [X(C13H13I1N2O2)]
dipole: 2.3234091 -0.0481361 -0.0091153 debye
polarizability: 304.2978053|-9.6852059|160.3517934|12.9236059|6.7230212|92.3954491 unknown
InChI: InChI=1S/C13H13IN2O2/c14-9-4-6-10(7-5-9)16-12(17)11-3-1-2-8-15(11)13(16)18/h4-7,11H,1-3,8H2
charge 0 multiplicity 1
31 atoms
I  -6.323999 0.117169 -0.410413
O  0.419398 -2.426657 0.569232
O  0.55335 2.277069 -0.090258
N  2.205959 0.655423 0.383851
N  0.0556 -0.077482 0.244228
C  2.293495 -0.799077 0.560994
C  3.223158 -1.43668 -0.502675
C  4.573639 -0.677167 -0.530347
C  3.416923 1.472664 0.233938
C  4.360276 0.832078 -0.813385
C  0.827901 -1.243311 0.467736
C  0.919939 1.101798 0.156743
C  -1.37454 -0.031086 0.098279
C  -2.081557 -1.182829 -0.335216
C  -2.086828 1.159506 0.394392
C  -3.485145 -1.141867 -0.474163
C  -3.489363 1.200166 0.248386
C  -4.182389 0.049992 -0.184823
H  2.67543 -1.049627 1.572253
H  2.739176 -1.372861 -1.49638
H  3.360192 -2.506344 -0.266007
H  5.231324 -1.11764 -1.301716
H  5.091585 -0.803787 0.443076
H  3.932317 1.546237 1.213265
H  3.1004 2.486833 -0.062575
H  5.32763 1.367734 -0.802261
H  3.922162 0.958737 -1.822264
H  -1.547813 -2.111689 -0.542454
H  -1.552201 2.056859 0.710044
H  -4.018716 -2.036149 -0.807831
H  -4.026504 2.125287 0.474548
