program: Gaussian 09
title: 000187972
version: EM64L-G09RevD.01
frameworkgroup: C1[X(C8H9NO5)]
method: RPBEPBE
basis: SDD
operation: Freq
keyword: #pfreq=noraman
keyword: PBEPBE/SDD
title: #p freq=noraman PBEPBE/SDD
converged: YES YES NO NO
title: Mulliken charges:
elementType: O O O O O N C C C C C C C C H H H H H H H H H
charge: -0.455071 -0.423289 -0.404169 -0.229319 -0.334883 -0.087695 -0.409168 -0.103267 -0.271577 -0.093032 0.140268 -0.315727 0.144044 0.130171 0.256335 0.248428 0.274788 0.262629 0.264028 0.251475 0.377993 0.376628 0.400411
chargesum: 0.00000
title: Mulliken charges with hydrogens summed into heavy atoms:
elementType: O O O O O N C C C C C C C C
charge: -0.077078 -0.046661 -0.003758 -0.229319 -0.334883 -0.087695 0.095594 0.171521 -0.008948 0.170996 0.140268 -0.064252 0.144044 0.130171
polarizability: 1.75947379e+02 -1.21005978e+00 1.11535657e+02 -1.39109585e+01 -1.39529943e+00 5.95860163e+01
1716.lowfreq: -6.2417 -0.0010 -0.0003 0.0003 3.9921 11.0312 27.7423 42.7757 49.6320
frequency: 27.5733 42.7753 49.6231 60.3582 157.7020 177.0348 231.8646 270.7230 273.8136 299.7318 333.4958 343.1240 411.8130 417.7950 453.1419 475.6599 520.7904 550.1127 575.7775 595.7605 619.9206 670.9240 719.0024 728.2087 731.4942 798.3437 804.5170 821.8358 860.5601 904.6461 921.4498 959.2169 1024.2339 1038.6895 1085.3945 1134.0707 1154.6890 1213.0421 1216.9671 1232.0105 1248.7703 1280.8728 1285.4848 1311.7096 1346.7493 1375.3070 1381.0497 1408.5215 1463.3673 1469.9854 1530.2124 1593.9554 1645.5537 1661.5654 2991.0212 3032.2694 3104.9475 3178.0392 3186.4038 3196.2879 3201.8672 3471.9360 3518.8277
redmass: 6.2731 8.9894 7.3719 7.7626 6.1696 6.4271 5.5291 3.8813 2.9328 5.5130 1.7482 4.7236 2.8247 3.1627 4.5209 4.7534 3.8067 4.4015 2.1024 4.7728 2.3121 3.1989 1.1471 3.2757 3.9326 1.8051 4.4163 1.4666 3.6609 2.8046 1.3389 3.3393 3.7853 3.0688 2.3186 1.9839 2.9657 1.5181 1.1745 1.2382 1.8164 1.7472 2.4319 1.2860 1.3199 1.6237 2.1146 1.7691 3.1692 1.2424 4.9679 5.6063 9.2676 6.1207 1.0828 1.0598 1.1057 1.0884 1.0916 1.0650 1.0979 1.0653 1.0645
irintensity: 1.8223 0.9789 7.4842 0.8040 2.3800 0.2974 6.8235 15.3329 49.6974 23.0001 70.0598 5.2370 23.8598 8.9454 10.7663 10.9176 3.9642 30.0447 78.8334 2.6155 52.4527 57.1097 87.8831 24.9811 13.4122 1.7056 2.9495 122.4133 20.5590 8.5262 3.8244 12.5033 275.3567 46.9529 103.7867 26.6548 37.5012 30.5489 15.8096 26.3899 377.1886 111.7627 50.5448 8.3215 1.0258 49.1451 49.9083 71.5720 88.4375 24.3064 16.8632 244.6679 249.7019 40.9558 13.5544 19.0916 4.5768 0.8085 4.5294 74.1287 2.2272 50.4632 50.0631
temp: 298.150 k
press: 1.00000 atm
elementType: 8 8 8 8 8 7 6 6 6 6 6 6 6 6 1 1 1 1 1 1 1 1 1
symmnumber: 1
zpe: 441377.7 jmol-1
zpe.correction: 0.168112 hartree
zpe.thermalcorrener: 0.181281 hartree
zpe.thermalcorrenthalpy: 0.182225 hartree
zpe.thermalcorrgfe: 0.126671 hartree
zpe.sumelectzpe: -740.065411 hartree
zpe.sumelectthermal: -740.052242 hartree
zpe.sumelectthermalent: -740.051298 hartree
zpe.sumelectthermalfe: -740.106852 hartree
dipole: -7.7207 1.4773 2.0728
dipole: 8.1295
quadrupole: -97.3541 -79.2778 -80.8488
quadrupole: -8.1416 -0.2575 -1.7060
quadrupole: -11.5272 6.5491 4.9781 -8.1416 -0.2575 -1.7060
hfenergy: -740.233523 hartree
pointgroup: C01 [X(C8H9N1O5)]
dipole: 3.0592023 -0.426468 0.8300887 debye
dipolederiv: -0.3361864 -0.01209 0.0203497 -0.1528289 -0.6427056 0.1145652 0.123489 0.0972399 -0.5837518 -0.6532206 -0.3705616 -0.0471162 -0.6667942 -0.8488419 -0.1392349 -0.0801404 -0.0931459 -0.4127917 -0.363756 0.2076466 -0.0582991 0.2812974 -1.1250701 0.2276515 -0.0976176 0.2370731 -0.4651457 -1.0638145 -0.2644212 0.106679 -0.1691689 -0.7176983 0.1531394 -0.0832185 0.1300754 -0.3366757 -1.4398714 0.0166232 -0.1969694 -0.0534698 -0.458265 -0.008674 -0.246055 0.0012774 -0.441807 -1.1242181 0.1979502 -0.1038192 0.0824304 -0.3586458 -0.0166756 -0.3510418 0.0610493 -0.1862789 1.0562891 -0.0790052 0.0220413 -0.0316082 0.1370233 0.0014898 -0.0175397 0.0747899 0.2018121 -0.4692145 0.1655067 -0.0611587 0.1630452 0.4982484 -0.0723578 -0.0134597 -0.075052 0.3413121 0.2454997 -0.2086266 0.0931844 0.47368 0.1351479 0.079765 0.1915715 -0.0548932 -0.1330148 0.6028052 -0.2713876 0.1036994 -0.4989266 0.2565463 -0.0617103 0.1179089 -0.1003751 -0.0412976 0.1863965 0.6038791 0.0463942 0.995244 0.4862227 0.2010448 0.0755083 0.1473381 0.0791765 -0.6172303 0.0362488 -0.0494877 -0.4039983 0.030942 -0.0686792 -0.0978848 0.0110658 -0.2212321 1.5045764 0.0964385 -0.045421 -0.0752377 1.3260221 -0.3553836 0.3166239 -0.371815 0.2808926 1.5000392 0.0186957 0.269528 -0.101187 0.1684635 -0.0238921 0.3184119 0.008567 0.2158848 0.0452936 -0.0204595 0.0157354 0.0509443 -0.0368928 0.0829123 -0.0006494 0.0331549 0.0770168 -0.0187565 -0.0092943 -0.01198 -0.0804728 0.0157559 -0.1174585 0.005887 -0.0516803 0.0137217 0.0856811 -0.0466935 -0.0348685 -0.0061376 -0.0594205 -0.041649 -0.0471988 -0.0566047 0.0032709 0.0632602 0.0830915 -0.0381499 0.055898 0.0184723 0.0063662 -0.0523635 0.0138884 0.1760134 0.0707573 -0.0784193 -0.0442977 -0.0603888 0.0553473 -0.0095152 -0.0368259 -0.0085061 0.1612493 0.0665745 0.0492199 -0.0189395 0.0275676 -0.0307781 -0.0006357 -0.0299995 0.0044103 0.1637058 0.204773 -0.109544 0.0502919 0.0243799 0.3739737 -0.0160639 0.0033406 -0.0289282 0.3569147 0.3177706 0.0108222 -0.0134514 0.2341516 0.419255 0.0468779 -0.0083781 0.0045974 0.3552807 0.1365518 -0.0156196 -0.0039449 -0.0884195 0.3568978 0.0181178 0.0096318 0.0164737 0.3957438 unknown
polarizability: 176.2418323|1.642189|111.3476641|12.5676708|-3.4233326|59.4795556 unknown
InChI: InChI=1S/C8H9NO5/c10-5-1-2-9(3-6(5)11)4-7(12)8(13)14/h1-3,7,11-13H,4H2
charge 0 multiplicity 1
23 atoms
O  1.985777 1.494212 -0.884424
O  -3.165113 -2.075757 -0.214897
O  3.624102 -1.60949 0.20876
O  4.477499 0.468212 -0.415676
O  -4.282402 0.31915 -0.419813
N  -0.250808 0.061137 0.550631
C  1.191329 -0.072283 0.829453
C  2.049478 0.10747 -0.454832
C  -1.011894 -1.097007 0.327447
C  -0.830815 1.314248 0.429528
C  -2.348505 -0.984329 0.00509
C  -2.173582 1.472139 0.112459
C  3.506079 -0.298197 -0.225061
C  -3.021363 0.325965 -0.121147
H  1.377913 -1.070083 1.259035
H  1.495682 0.696188 1.560856
H  1.637836 -0.54923 -1.24806
H  -0.510624 -2.060332 0.437739
H  -0.156948 2.16068 0.574074
H  -2.597391 2.475783 0.03196
H  2.916605 1.830373 -1.003221
H  -4.068905 -1.662544 -0.418064
H  4.581052 -1.859005 0.322763
