program: Gaussian 09
title: 000187971
version: EM64L-G09RevD.01
frameworkgroup: C1[X(C9H12N2O4)]
method: RPBEPBE
basis: SDD
operation: Freq
keyword: #p
keyword: freq=noraman
keyword: PBEPBE/SDD
title: #p freq=noraman PBEPBE/SDD
converged: YES YES NO NO
title: Mulliken charges:
elementType: O O O O N N C C C C C C C C C H H H H H H H H H H H H
charge: -0.379973 -0.403995 -0.245557 -0.260904 -0.144962 -0.554266 -0.455399 -0.198663 0.231969 -0.157809 0.007351 -0.792177 -0.333778 0.191527 0.145161 0.270901 0.248806 0.267802 0.263817 0.219619 0.257738 0.260120 0.250914 0.287360 0.298486 0.340407 0.385504
chargesum: 0.00000
title: Mulliken charges with hydrogens summed into heavy atoms:
elementType: O O O O N N C C C C C C C C C
charge: -0.039566 -0.018491 -0.245557 -0.260904 -0.144962 0.031580 0.064308 0.069139 0.231969 0.106008 0.007351 -0.054700 -0.082864 0.191527 0.145161
polarizability: 1.56127012e+02 -1.60357671e+01 1.34621181e+02 1.62237454e+01 3.38513772e+00 8.88565849e+01
1716.lowfreq: -8.5528 -6.2257 -5.7587 -0.0010 -0.0008 -0.0007 24.6278 29.2145 52.2432
frequency: 24.5498 28.2015 52.2362 58.8620 75.3772 116.9665 138.0602 189.6660 241.6771 248.9836 260.2176 288.0822 305.7132 320.6563 342.3431 360.6189 410.8788 463.0088 471.9457 515.0983 519.8156 547.1641 565.0240 585.3276 610.0170 640.2771 648.1920 708.9922 730.1130 780.3934 787.3240 818.4725 856.1246 933.7248 961.7790 978.7362 1019.5708 1033.3107 1053.9088 1058.7711 1102.3279 1118.9660 1169.1716 1201.4193 1209.4069 1219.9850 1244.3477 1260.5758 1332.1439 1338.5685 1359.0993 1368.2569 1395.8293 1409.0002 1451.7363 1462.8108 1482.5726 1507.7353 1547.8592 1564.6568 1634.1341 1641.8616 1649.1820 2974.8026 3032.3919 3051.9454 3069.9224 3084.8199 3108.9902 3163.2334 3187.7360 3462.1149 3500.5711 3573.0487 3592.8318
redmass: 6.0967 2.3160 7.1901 2.3010 3.5665 3.5723 3.7093 4.2499 3.0010 2.4390 1.6522 2.4426 2.0493 6.7544 4.0589 2.5802 2.2648 3.8705 6.6713 4.5447 4.4819 3.9913 3.3584 3.2634 1.3041 1.5760 4.4243 3.9712 3.3123 4.6858 3.9992 1.7944 2.3668 1.2813 2.0432 2.9494 1.9747 1.4470 2.1040 1.8458 3.6801 2.2005 1.4510 4.4519 1.6589 1.3087 1.9297 2.2515 2.3387 1.3719 1.5223 1.4427 1.7539 1.2275 2.2810 1.1947 1.3233 1.0861 6.2933 6.8138 6.5073 1.3984 3.0773 1.0404 1.0641 1.0971 1.0853 1.0952 1.1008 1.0883 1.0988 1.0452 1.0641 1.0652 1.0985
irintensity: 2.3153 1.2180 1.2084 1.6126 2.4152 5.7575 1.4120 4.2573 3.9477 40.4625 69.2659 16.9234 26.8514 10.2389 6.9303 11.7881 2.8099 35.2339 5.5399 25.5597 4.8828 15.9359 19.2190 9.8260 192.0967 178.8582 9.6950 33.3751 3.3257 10.2068 5.0919 60.0358 3.9616 0.9738 6.0919 53.0216 85.0058 4.7629 198.1012 44.2618 6.8670 92.0143 25.0713 34.0000 102.2221 9.3344 73.9019 52.9698 19.4279 12.5817 12.6328 12.3986 18.1118 7.7930 13.9883 15.3330 41.6992 3.3907 70.5119 92.5099 248.6678 81.4463 160.3465 26.2885 16.3663 17.1498 14.2929 18.9113 5.4341 0.4995 2.5286 7.3165 28.5972 17.8048 9.4420
temp: 298.150 k
press: 1.00000 atm
elementType: 8 8 8 8 7 7 6 6 6 6 6 6 6 6 6 1 1 1 1 1 1 1 1 1 1 1 1
symmnumber: 1
zpe: 545642.1 jmol-1
zpe.correction: 0.207824 hartree
zpe.thermalcorrener: 0.223413 hartree
zpe.thermalcorrenthalpy: 0.224357 hartree
zpe.thermalcorrgfe: 0.163283 hartree
zpe.sumelectzpe: -759.400535 hartree
zpe.sumelectthermal: -759.384946 hartree
zpe.sumelectthermalent: -759.384002 hartree
zpe.sumelectthermalfe: -759.445076 hartree
dipole: -8.8026 4.8833 -0.4552
dipole: 10.0767
quadrupole: -107.5840 -81.2931 -86.3384
quadrupole: 12.9850 -7.9792 -0.4479
quadrupole: -15.8455 10.4454 5.4001 12.9850 -7.9792 -0.4479
hfenergy: -759.608359 hartree
pointgroup: C01 [X(C9H12N2O4)]
dipole: -3.5036767 1.8544193 -0.0486268 debye
polarizability: 157.1092116|-16.3002166|133.4625051|14.6289311|6.1560035|89.0330612 unknown
InChI: InChI=1S/C9H12N2O4/c1-5-8(13)7(12)2-3-11(5)4-6(10)9(14)15/h2-3,6,13-14H,4,10H2,1H3
charge 0 multiplicity 1
27 atoms
O  3.371026 1.29824 0.73152
O  -2.764556 -1.026352 1.758369
O  -2.790816 -1.677481 -0.475905
O  3.828659 -1.366413 0.202527
N  0.103204 0.280558 -0.752582
N  -3.474133 1.434476 -0.22282
C  -1.247738 0.79514 -1.064746
C  -2.252215 0.677939 0.111564
C  1.0799 1.094147 -0.128709
C  0.397028 -1.047845 -1.049916
C  2.331802 0.55237 0.160181
C  0.744627 2.546045 0.160045
C  1.615295 -1.616307 -0.746401
C  -2.594808 -0.79558 0.392566
C  2.691685 -0.86778 -0.098566
H  -1.205293 1.855971 -1.354465
H  -1.640658 0.225402 -1.926009
H  -1.816522 1.111304 1.026483
H  -0.406726 -1.608764 -1.533959
H  1.358563 2.935025 0.992917
H  -0.302109 2.68683 0.475902
H  0.918295 3.198783 -0.717539
H  1.806455 -2.662031 -1.00113
H  -4.001762 1.054172 -1.015946
H  -4.072018 1.655436 0.578373
H  3.14218 2.259067 0.792089
H  -3.036066 -1.972354 1.914955
