program: Gaussian 09
title: 000187952
version: EM64L-G09RevD.01
frameworkgroup: C1[X(C8H8ClNO2)]
method: RPBEPBE
basis: SDD
operation: Freq
keyword: #p
keyword: freq=noraman
keyword: PBEPBE/SDD
title: #p freq=noraman PBEPBE/SDD
converged: YES YES NO NO
title: Mulliken charges:
elementType: Cl O O N C C C C C C C C H H H H H H H H
charge: -0.072560 -0.205600 -0.205522 0.020791 0.463348 0.341710 -0.521313 -0.370425 0.397306 -0.369392 -0.790794 -0.810436 0.293395 0.247195 0.289557 0.273548 0.286723 0.235814 0.237810 0.258846
chargesum: 0.00000
title: Mulliken charges with hydrogens summed into heavy atoms:
elementType: Cl O O N C C C C C C C C
charge: -0.072560 -0.205600 -0.205522 0.020791 0.463348 0.341710 -0.227918 -0.123230 0.397306 -0.079836 -0.230523 -0.077966
polarizability: 1.62040028e+02 -3.46539540e+00 1.19989689e+02 -3.97095553e+00 -7.21760721e+00 6.32594247e+01
1716.lowfreq: -4.6672 -0.0014 -0.0013 0.0013 6.4348 13.5329 53.7273 57.2166 107.4264
frequency: 53.7201 57.1816 107.4135 112.1446 143.4039 191.3453 231.8041 299.2441 311.3824 350.7220 384.4327 442.6926 504.7279 524.4400 561.2409 616.9923 624.8079 706.0822 733.8309 740.9095 756.2641 847.2124 902.3154 917.4082 945.6260 988.8653 999.6663 1045.6682 1081.5818 1115.6831 1145.5582 1194.0779 1214.5380 1243.0743 1248.0582 1276.8706 1366.7373 1394.8430 1404.4580 1418.7844 1461.2808 1469.1922 1480.0793 1485.6110 1589.2374 1613.9197 2976.9611 3055.1785 3071.4064 3096.8637 3144.5704 3151.0171 3166.4620 3184.9575
redmass: 11.5562 10.2915 3.5612 5.8112 1.1185 5.1528 5.7795 2.5135 4.4974 7.2628 3.6490 3.0881 4.3288 5.1706 6.2819 6.3187 6.4664 5.5599 3.7350 4.1995 8.0865 1.3298 2.2255 2.2749 1.5652 1.3517 1.5507 1.5858 1.9723 1.2585 1.3121 2.8076 6.5099 2.9599 1.2373 1.3159 9.0769 2.7087 1.6954 3.1522 1.2148 1.0789 2.1942 1.2493 7.7492 6.8381 1.0394 1.0950 1.0579 1.0990 1.0906 1.1110 1.0924 1.0952
irintensity: 1.6051 1.5997 0.3032 2.6634 1.0439 0.6628 3.6433 1.1723 3.0862 1.0758 0.6464 3.1315 6.4420 2.4734 39.9045 30.5737 15.3839 9.8356 7.9363 6.8918 15.2596 23.1416 9.9655 4.9016 16.7927 2.8474 3.0288 11.9221 23.0548 10.7470 18.4747 13.3255 288.5889 44.8714 13.8114 2.6603 114.0194 11.3876 12.0582 10.7256 20.4480 22.5483 11.1925 10.8399 16.4752 32.1040 12.6537 11.2254 14.6754 13.9026 10.5434 3.8803 1.6598 2.6336
temp: 298.150 k
press: 1.00000 atm
elementType: 17 8 8 7 6 6 6 6 6 6 6 6 1 1 1 1 1 1 1 1
symmnumber: 1
zpe: 383717.4 jmol-1
zpe.correction: 0.146150 hartree
zpe.thermalcorrener: 0.157418 hartree
zpe.thermalcorrenthalpy: 0.158362 hartree
zpe.thermalcorrgfe: 0.107739 hartree
zpe.sumelectzpe: -973.959636 hartree
zpe.sumelectthermal: -973.948369 hartree
zpe.sumelectthermalent: -973.947425 hartree
zpe.sumelectthermalfe: -973.998048 hartree
dipole: -3.7996 3.5096 1.8264
dipole: 5.4854
quadrupole: -95.8090 -72.9874 -75.8320
quadrupole: 1.1195 -4.3476 -2.8095
quadrupole: -14.2662 8.5554 5.7108 1.1195 -4.3476 -2.8095
hfenergy: -974.1057865 hartree
pointgroup: C01 [X(C8H8Cl1N1O2)]
dipole: -1.6945102 1.1429736 0.6926737 debye
dipolederiv: -0.4594072 -0.2153128 -0.1057148 -0.2224348 -0.3450075 -0.0682694 -0.3352789 -0.2420246 -0.3607684 -0.889572 -0.1551066 0.0738126 -0.1467004 -0.5215645 0.0747286 0.0870978 0.0730394 -0.2505607 -0.6183935 0.1602516 -0.0095341 0.219416 -0.7605531 0.1001348 -0.0096238 0.0984239 -0.246408 1.8143923 -0.1855621 -0.0754015 -0.2790571 1.0920405 -0.1790753 -0.0883362 -0.1667313 0.23285 -0.2361879 0.1061173 -0.0227587 0.2438003 -0.1604895 0.0048622 0.0489379 0.079664 -0.1346593 0.5218358 -0.2186758 -0.0390752 -0.0998816 0.1188141 0.0021196 -0.0355514 0.012373 0.006803 0.2184301 -0.1112005 -0.0029569 0.0775103 -0.0782101 -0.0261562 -0.0710753 -0.0020955 -0.0957729 -0.4764147 0.0230728 0.0237907 -0.1245324 0.1538623 -0.0404811 0.0616332 -0.0638676 -0.1373817 -0.6487528 0.1865488 0.018638 0.2236357 -0.1086909 0.0029937 0.0287728 0.0235908 0.0628885 0.1436827 -0.0093233 -0.0368225 -0.285335 0.0382874 -0.0092584 0.0379177 -0.0286339 -0.0873362 0.5506031 0.2993565 0.1917401 0.3294386 0.3911145 0.1143728 0.3058865 0.2104189 0.4749417 -0.3005134 0.1029349 -0.0049141 -0.0121236 0.045679 -0.0260211 0.0413617 -0.0622062 0.0296331 0.1365815 0.0184354 0.0081982 -0.0059711 0.0330562 0.0238762 0.0002379 0.0202341 0.1512864 0.0611186 0.0582935 -0.0053071 0.0382214 -0.0743698 0.0358922 -0.0034532 0.0417904 0.1404731 0.0759056 -0.0588227 0.0209096 -0.0275544 0.0996962 0.0166224 0.0114534 0.0190196 0.1639336 -0.05509 -0.0279623 0.0325288 0.0295774 0.0554046 -0.0964853 -0.0043574 -0.0756979 -0.0263736 0.0362822 0.0658371 -0.098582 -0.0220327 -0.0270021 0.0334636 -0.0677344 0.0103117 0.0036764 0.0250094 0.0287943 0.0578377 0.0346283 0.0937319 0.0496549 0.0921527 0.0133984 -0.0749624 0.0827004 -0.0475308 0.0170301 0.0566433 -0.116729 0.0590992 -0.015146 0.0737494 0.0977157 0.0177897 -0.0201455 -0.0434189 -0.027248 0.0709297 -0.0720733 -0.084895 -0.0347566 0.0500216 unknown
polarizability: 162.2819969|2.381972|120.3841615|1.783068|-4.9424884|62.6229828 unknown
InChI: InChI=1S/C8H8ClNO2/c1-6-2-3-8(10(11)12)4-7(6)5-9/h2-4H,5H2,1H3
charge 0 multiplicity 1
20 atoms
Cl -3.160611 -1.893458 -0.964356
O  3.541103 0.46305 -0.257361
O  2.810279 -1.63932 0.242754
N  2.60441 -0.387179 0.002006
C  -1.171126 -0.344339 0.332567
C  -1.459235 1.037197 0.082915
C  0.164897 -0.802393 0.300262
C  -0.381858 1.917719 -0.192429
C  1.206251 0.106091 0.026581
C  0.953237 1.470732 -0.222674
C  -2.264644 -1.324929 0.638235
C  -2.881614 1.55773 0.101829
H  0.409752 -1.85357 0.479764
H  -0.596478 2.974034 -0.386503
H  1.787142 2.145278 -0.433266
H  -3.076373 -0.907082 1.24981
H  -1.888911 -2.258657 1.077529
H  -3.319966 1.503469 1.117482
H  -2.924705 2.610304 -0.222066
H  -3.532549 0.961524 -0.56338
