program: Gaussian 09
title: 000196234
version: EM64L-G09RevD.01
frameworkgroup: C1[X(C14H24N2O)]
method: RPBEPBE
basis: SDD
operation: Freq
keyword: #p
keyword: freq=noraman
keyword: PBEPBE/SDD
title: #p freq=noraman PBEPBE/SDD
converged: NO YES NO NO
title: Mulliken charges:
elementType: O N N C C C C C C C C C C C C C C H H H H H H H H H H H H H H H H H H H H H H H H
charge: -0.279109 -0.013226 -0.095932 -0.098939 -0.099184 -0.244790 -0.255286 -0.464180 -0.454401 -0.454923 -0.453624 -0.454348 0.113832 -0.281497 -0.352096 -0.614544 -0.613448 0.205409 0.205698 0.237383 0.275004 0.198471 0.198203 0.203458 0.213415 0.215148 0.203419 0.213081 0.203503 0.203301 0.215463 0.225111 0.203559 0.214819 0.210783 0.219982 0.187900 0.226898 0.224323 0.189674 0.221691
chargesum: 0.00000
title: Mulliken charges with hydrogens summed into heavy atoms:
elementType: O N N C C C C C C C C C C C C C C
charge: -0.279109 -0.013226 -0.095932 0.106470 0.106514 -0.007407 0.019718 -0.067506 -0.037527 -0.036357 -0.037041 -0.035584 0.113832 0.147173 0.073506 0.020235 0.022239
polarizability: 2.14664756e+02 2.10051643e+00 1.40410588e+02 5.40573883e+00 -1.56427695e+00 1.41422823e+02
1716.lowfreq: -38.2911 -13.8813 -5.9172 0.0004 0.0005 0.0008 9.0191 21.3129 30.3982
frequency: -22.8899 19.7692 30.2283 67.1587 95.3408 123.4310 189.3231 214.2191 223.4034 246.2509 262.6043 281.0542 315.1230 343.3458 348.8020 355.1078 402.7400 409.4832 416.0596 419.6686 423.9653 455.2829 518.4604 596.6865 622.6375 649.7250 717.9447 734.2071 767.2187 786.1148 790.6865 799.3258 823.5161 850.6710 870.8198 877.5325 886.5935 908.4617 943.7042 952.3948 973.5729 1000.2356 1013.2849 1026.3417 1032.9820 1034.7514 1061.3257 1062.9097 1065.5262 1073.9252 1082.4024 1090.8130 1094.4876 1104.3419 1113.7279 1115.2036 1140.5181 1144.0329 1182.1195 1206.3440 1248.3500 1249.1845 1260.7544 1262.5220 1267.4062 1281.2869 1290.7443 1293.9843 1295.0734 1312.8926 1318.1523 1322.7738 1325.7681 1341.2925 1347.4126 1347.9823 1351.4573 1356.1805 1372.6565 1419.7489 1440.1994 1449.6478 1449.7958 1459.7026 1461.5574 1462.7616 1464.8353 1467.5158 1475.1386 1479.2686 1480.8223 1485.5504 1601.9748 2847.8323 2858.6671 2890.4791 2963.3310 2969.7791 2971.7755 2971.9857 2973.8002 2997.1373 3004.1820 3009.4077 3016.0474 3020.7676 3025.9249 3029.2228 3033.5867 3034.1210 3035.5742 3036.3051 3038.4373 3064.0820 3075.4478 3085.4358 3093.7364
redmass: 3.6416 2.7642 3.8109 3.6528 2.4607 3.1924 2.4649 1.3450 2.3767 1.2828 2.7353 2.2990 2.7987 2.4865 2.7653 2.9264 2.9425 2.3509 4.5613 1.8772 1.8762 3.1101 4.3898 7.0380 3.7098 4.1121 3.5783 4.5715 2.8802 2.5528 2.6928 1.7508 4.0821 2.7860 1.5606 1.7194 2.2782 2.1767 2.0871 2.1518 7.5318 2.0162 5.7091 2.4282 2.0877 1.5389 1.9499 1.6474 1.6498 1.7646 2.0019 1.3192 1.6076 1.2717 1.0109 1.0127 1.4989 1.2247 1.6379 1.0519 1.4773 1.6094 1.6956 1.7416 2.5057 1.8160 1.1809 1.9330 1.8737 1.9937 1.3460 1.3051 1.3098 1.5339 1.5860 1.5497 1.4240 1.6383 1.3503 1.1396 1.1422 1.0947 1.0816 1.0862 1.0504 1.0906 1.0904 1.0576 1.0518 1.0890 1.0915 1.0539 9.1087 1.0570 1.0579 1.0681 1.0621 1.0631 1.0615 1.0618 1.0601 1.0824 1.0823 1.0606 1.0724 1.1029 1.0726 1.1031 1.0985 1.0972 1.0889 1.0970 1.1013 1.0864 1.1007 1.1003 1.1057
irintensity: 0.7930 0.1557 0.3960 0.3616 0.6167 0.6334 2.2090 1.0662 2.6931 1.9091 0.3939 1.0842 1.3702 11.2420 0.5163 1.1871 9.7079 3.9194 0.2634 1.1185 1.0473 7.1741 0.4863 0.0539 0.3743 2.6407 0.1812 10.0156 49.1115 11.0975 2.9916 25.2525 17.3927 43.1883 0.0383 19.1781 7.3119 0.0040 5.3476 15.9813 161.5155 4.2741 0.3697 81.5862 0.4415 15.1294 6.0826 0.0866 3.1094 9.9716 8.3034 10.9075 7.4179 0.4624 0.0156 0.0218 1.9723 0.0344 2.1043 5.5558 0.0662 5.0510 0.4250 1.5732 11.5148 2.3564 1.7455 0.3846 1.2910 2.4710 6.8898 0.0106 0.0400 0.6819 0.2306 0.0911 2.2105 0.1805 2.5595 2.6386 0.3860 3.1894 0.5051 6.5174 13.5685 19.9222 18.8592 6.6017 23.1623 24.0235 4.1307 10.1793 5.9663 74.7272 159.5661 100.9041 27.8902 16.3670 22.9523 7.0590 79.8872 138.8832 130.1084 34.9020 47.4176 20.9879 70.4598 3.0598 59.2650 72.5742 18.8109 5.0995 67.0877 11.9795 31.2802 45.8402 33.6477
temp: 298.150 k
press: 1.00000 atm
elementType: 8 7 7 6 6 6 6 6 6 6 6 6 6 6 6 6 6 1 1 1 1 1 1 1 1 1 1 1 1 1 1 1 1 1 1 1 1 1 1 1 1
symmnumber: 1
zpe: 950130.2 jmol-1
zpe.correction: 0.361885 hartree
zpe.thermalcorrener: 0.377485 hartree
zpe.thermalcorrenthalpy: 0.378430 hartree
zpe.thermalcorrgfe: 0.318221 hartree
zpe.sumelectzpe: -731.206142 hartree
zpe.sumelectthermal: -731.190542 hartree
zpe.sumelectthermalent: -731.189598 hartree
zpe.sumelectthermalfe: -731.249807 hartree
dipole: 1.3743 0.8096 0.9505
dipole: 1.8567
quadrupole: -95.5295 -102.3538 -104.2858
quadrupole: -1.7625 -3.2965 -0.7916
quadrupole: 5.1936 -1.6308 -3.5628 -1.7625 -3.2965 -0.7916
hfenergy: -731.5680276 hartree
pointgroup: C01 [X(C14H24N2O1)]
dipole: 0.5513485 -0.1354323 0.4596591 debye
polarizability: 214.9178478|-0.4814367|142.3594681|3.8311937|0.5016549|139.2208509 unknown
InChI: InChI=1S/C14H24N2O/c1-16(2)3-4-17-15-14-12-6-10-5-11(8-12)9-13(14)7-10/h10-13H,3-9H2,1-2H3
charge 0 multiplicity 1
41 atoms
O  -1.363195 0.937148 -0.839664
N  -0.593098 -0.295568 -0.527161
N  -4.923006 -0.023682 0.069351
C  2.950476 0.391989 1.501316
C  3.492402 0.16971 -0.971824
C  1.59124 -1.186244 0.040736
C  1.347587 1.338435 -0.24097
C  4.090957 0.384834 0.445942
C  2.198342 -0.966405 1.460443
C  2.740331 -1.188861 -1.014454
C  1.957412 1.543093 1.181146
C  2.498727 1.320296 -1.294263
C  0.663217 -0.019508 -0.268963
C  -2.767982 0.543233 -1.057502
C  -3.498344 0.326815 0.281471
C  -5.789749 0.369841 1.197712
C  -5.122278 -1.438621 -0.305985
H  3.379209 0.546194 2.511277
H  4.306465 0.164643 -1.723269
H  1.022372 -2.132446 0.000394
H  0.622025 2.135186 -0.472364
H  4.646129 1.343768 0.48161
H  4.816057 -0.421191 0.677391
H  2.894212 -1.797141 1.693729
H  1.393809 -0.983707 2.221324
H  2.322719 -1.365987 -2.024564
H  3.438234 -2.020826 -0.792389
H  1.149025 1.576528 1.93726
H  2.48088 2.519676 1.213359
H  3.02369 2.296349 -1.274613
H  2.077793 1.191548 -2.310221
H  -3.217461 1.389414 -1.604664
H  -2.794211 -0.361453 -1.691949
H  -2.947254 -0.446199 0.871215
H  -3.449677 1.271892 0.853364
H  -6.846718 0.177512 0.936819
H  -5.566899 -0.18077 2.147505
H  -5.679523 1.450992 1.394616
H  -4.513796 -1.69207 -1.190623
H  -4.847638 -2.150623 0.513987
H  -6.182978 -1.60729 -0.566125
