program: Gaussian 09
title: 000187950
version: EM64L-G09RevD.01
frameworkgroup: C1[X(C10H16N2)]
method: RPBEPBE
basis: SDD
operation: Freq
keyword: #pfreq=noraman
keyword: PBEPBE/SDD
title: #p freq=noraman PBEPBE/SDD
converged: YES YES NO NO
title: Mulliken charges:
elementType: N N C C C C C C C C C C H H H H H H H H H H H H H H H H
charge: -0.419690 -0.535035 -0.583317 -0.362790 0.401315 -0.337256 0.243267 -0.413089 -0.695340 -0.431387 -0.274482 -0.221230 0.218875 0.187196 0.211018 0.208329 0.196545 0.189074 0.226557 0.212537 0.211151 0.215999 0.219544 0.221885 0.218353 0.313962 0.291753 0.286257
chargesum: 0.00000
title: Mulliken charges with hydrogens summed into heavy atoms:
elementType: N N C C C C C C C C C C
charge: -0.105728 0.042975 -0.177246 0.056557 0.401315 0.048363 0.243267 -0.186533 -0.055653 -0.211843 -0.052597 -0.002876
polarizability: 1.48509230e+02 -5.46999241e+00 1.38306635e+02 -1.31157471e+01 -1.63965748e+00 8.09652138e+01
1716.lowfreq: -0.0010 -0.0007 -0.0005 7.4060 11.9376 14.6714 47.2297 68.9853 75.9121
frequency: 47.2070 68.8557 75.8758 88.4746 133.4145 173.9910 213.9774 233.1475 246.5004 275.8975 299.6079 329.3398 385.8589 469.0948 484.5040 524.9250 567.8461 571.4984 604.5233 638.1583 733.0395 735.3524 754.3422 785.2744 795.0178 835.5209 851.6838 897.9716 918.1273 934.8117 967.9430 1006.7252 1038.7445 1057.7232 1069.5268 1105.6350 1111.2184 1167.1173 1175.6955 1197.9428 1207.6187 1254.0255 1254.7988 1267.7224 1285.7685 1290.6263 1314.4084 1325.9608 1350.0156 1379.1260 1393.3160 1439.0574 1448.9182 1468.9533 1476.6009 1478.5448 1486.2930 1492.6112 1499.8040 1592.0994 1616.0744 1671.6874 2940.0879 2960.0358 2973.2740 2978.7066 3001.1170 3014.9304 3043.9596 3070.2050 3071.8827 3112.5244 3123.7212 3143.6791 3162.0951 3389.6956 3515.8445 3581.3929
redmass: 3.7198 2.4312 1.9620 3.6485 2.4025 3.4464 2.6360 1.1819 2.9289 1.3468 3.3741 2.7119 2.9607 3.1148 3.6641 1.8434 1.8334 2.2174 3.2615 2.1175 1.1110 2.5361 1.4280 2.0385 1.7440 3.7655 1.5255 1.7605 1.2800 1.3907 1.3060 4.2073 1.9032 1.9248 2.5671 2.1111 1.8864 1.2860 1.4418 2.5668 1.5973 1.1820 1.3241 1.3002 1.1673 1.2834 2.6195 1.4393 1.5548 3.7417 1.2154 2.1057 1.7545 1.0652 1.0886 1.0482 1.1209 1.6360 1.4003 5.2067 6.2241 1.0745 1.0665 1.0593 1.0369 1.0597 1.0978 1.0950 1.1032 1.1006 1.0994 1.0875 1.0869 1.0924 1.1002 1.0416 1.1013 1.0776
irintensity: 0.0288 0.1266 0.7306 5.2804 0.1165 2.2002 1.3918 0.0617 6.2961 2.5117 0.4624 2.0162 0.5620 0.9170 2.8724 95.2151 77.3463 66.0225 36.9831 155.9576 7.2266 10.3792 64.6440 4.8083 3.6497 0.3691 0.5746 4.5436 2.0570 2.3198 0.0413 0.4173 2.8446 12.6622 1.3411 11.1786 7.2474 0.9200 9.1648 1.4410 0.6964 0.3155 3.1783 0.2411 3.2003 4.6898 46.0332 1.3232 1.1055 22.2642 11.8197 18.3018 14.0001 0.4555 1.3364 13.5428 11.0743 54.6701 50.0307 17.0039 50.2848 18.7309 31.8098 33.1212 31.2246 52.7218 9.9384 5.2223 40.0105 79.7812 55.4060 14.8244 8.2857 29.3309 29.1455 10.9038 0.2008 25.8875
temp: 298.150 k
press: 1.00000 atm
elementType: 7 7 6 6 6 6 6 6 6 6 6 6 1 1 1 1 1 1 1 1 1 1 1 1 1 1 1 1
symmnumber: 1
zpe: 637904.4 jmol-1
zpe.correction: 0.242965 hartree
zpe.thermalcorrener: 0.255899 hartree
zpe.thermalcorrenthalpy: 0.256844 hartree
zpe.thermalcorrgfe: 0.203368 hartree
zpe.sumelectzpe: -499.211853 hartree
zpe.sumelectthermal: -499.198918 hartree
zpe.sumelectthermalent: -499.197974 hartree
zpe.sumelectthermalfe: -499.251450 hartree
dipole: -0.1948 0.7083 0.0772
dipole: 0.7386
quadrupole: -68.6668 -70.8692 -75.7712
quadrupole: 5.2389 -3.1808 -1.5479
quadrupole: 3.1023 0.8998 -4.0021 5.2389 -3.1808 -1.5479
hfenergy: -499.4548176 hartree
pointgroup: C01 [X(C10H16N2)]
dipole: 0.0843777 0.2780341 -0.0052019 debye
polarizability: 149.2880873|6.1269673|137.2708893|-11.1992774|6.8978165|81.2221023 unknown
InChI: InChI=1S/C10H16N2/c1-2-3-6-9-7-4-5-8-10(9)12-11/h4-5,7-8,12H,2-3,6,11H2,1H3
charge 0 multiplicity 1
28 atoms
N  -0.338965 1.908595 -0.06863
N  -0.988249 3.136392 0.165439
C  1.177992 -0.44732 -0.917769
C  2.194809 -0.314544 0.25304
C  -0.272987 -0.520093 -0.46211
C  3.655887 -0.193151 -0.234978
C  -0.982742 0.654697 -0.038441
C  -0.947929 -1.759914 -0.420895
C  4.666697 -0.070155 0.925551
C  -2.32761 0.542284 0.411509
C  -2.285121 -1.877286 0.027529
C  -2.968706 -0.714667 0.44488
H  1.42441 -1.362253 -1.489971
H  1.333507 0.397115 -1.625216
H  2.094577 -1.200279 0.911296
H  1.938614 0.56359 0.87911
H  3.908237 -1.076636 -0.856669
H  3.748138 0.690083 -0.900858
H  -0.408267 -2.656424 -0.752704
H  4.618294 -0.953985 1.589254
H  4.45356 0.822952 1.54272
H  5.703865 0.015913 0.5525
H  -2.868061 1.437017 0.738706
H  -2.780441 -2.853568 0.045769
H  -4.004928 -0.780424 0.796897
H  0.581868 1.991789 -0.494364
H  -1.205143 3.294825 1.156395
H  -1.791404 3.306847 -0.45539
