program: Gaussian 09
title: 000187939
version: EM64L-G09RevD.01
frameworkgroup: C1[X(C12H12BrN3S2)]
method: RPBEPBE
basis: SDD
operation: Freq
keyword: #p
keyword: freq=noraman
keyword: PBEPBE/SDD
title: #p freq=noraman PBEPBE/SDD
converged: YES YES NO NO
title: Mulliken charges:
elementType: Br S S N N N C C C C C C C C C C C C H H H H H H H H H H H H
charge: 0.004325 0.054501 0.061908 -0.029389 -0.029372 -0.225991 -0.352789 -0.353555 -0.406817 -0.406397 -0.285811 -0.288691 0.499944 -0.288438 -0.343308 -0.172293 -0.195318 -0.211841 0.265555 0.240874 0.266202 0.240213 0.219777 0.231292 0.220495 0.231218 0.289799 0.272858 0.237518 0.253531
chargesum: 0.00000
title: Mulliken charges with hydrogens summed into heavy atoms:
elementType: Br S S N N N C C C C C C C C C C C C
charge: 0.004325 0.054501 0.061908 -0.029389 -0.029372 -0.225991 0.153639 0.152860 0.044253 0.045316 -0.285811 -0.288691 0.499944 0.001361 -0.070451 -0.172293 0.042200 0.041690
polarizability: 2.70131358e+02 6.09944255e+00 2.14351411e+02 -6.99680200e+00 2.11329867e+00 1.24528302e+02
1716.lowfreq: -5.5998 -2.4843 0.0010 0.0014 0.0023 3.4858 27.4486 35.6193 65.8399
frequency: 27.3845 35.5986 65.8341 83.7196 86.3931 104.8370 160.6468 187.9445 195.4156 213.7488 226.5751 256.4420 264.0251 271.4613 311.9795 332.3547 397.5227 412.4713 437.5623 453.2865 500.1323 517.3660 530.7522 569.9340 633.1804 644.9603 659.7473 677.5346 688.6868 762.8147 787.5240 794.1710 821.2414 864.5525 883.2113 905.9573 911.6575 967.5685 976.3079 980.7763 982.5350 1018.0693 1067.0513 1080.2920 1089.7981 1103.8744 1117.9597 1144.3824 1173.7577 1179.1310 1184.5388 1251.1894 1252.6298 1258.1486 1276.1575 1290.1438 1332.8512 1334.6697 1347.8760 1352.0926 1357.4295 1377.3805 1392.4296 1399.4913 1423.5634 1460.9170 1463.4081 1468.4021 1476.3890 1481.1439 1578.7082 1601.2506 2973.2628 2973.8634 3002.2816 3004.5570 3069.3795 3074.4804 3082.4090 3084.8266 3150.0022 3173.0496 3184.3399 3188.4071
redmass: 9.5082 6.3416 6.2549 5.2703 3.7050 6.9095 6.2895 5.3598 7.3620 4.5371 3.8832 4.7324 4.8333 7.1872 6.5184 1.9612 10.6095 5.3540 3.2520 2.9659 5.2257 3.8088 4.7763 11.2035 6.6462 4.9405 5.4322 5.6359 2.3411 2.8604 3.1612 2.3673 1.4529 2.4445 1.5013 1.4035 1.3754 2.2323 1.3788 3.4513 5.6713 6.0480 2.0564 1.5623 2.1613 2.4124 2.0382 3.0417 1.3663 1.0887 3.1795 1.3269 1.3526 3.1636 2.9318 1.5484 3.1377 1.3901 1.4239 1.4647 1.5590 9.2461 5.2871 4.8530 3.0325 1.0877 1.0918 2.7344 1.0856 1.0864 7.0727 6.6858 1.0685 1.0684 1.0652 1.0600 1.0985 1.0984 1.0956 1.0997 1.0878 1.0938 1.0972 1.0948
irintensity: 0.5507 2.9696 2.7364 1.1466 1.2050 0.4031 0.0375 2.2667 0.8853 4.9947 2.8744 12.8912 3.7858 5.0826 2.0738 13.7304 3.1759 0.3122 2.5882 10.0078 0.2205 8.1699 0.1054 25.9513 0.7798 0.4152 16.6121 19.9599 29.9443 33.2296 34.7146 8.5860 1.2161 23.0732 7.5711 5.4091 5.0972 17.7229 0.0762 0.9968 11.0035 7.0777 16.4789 1.8228 33.6779 28.6747 11.1243 2.2861 1.8506 2.0777 30.4364 116.8653 84.1503 373.9076 121.8599 68.3931 0.6039 14.8994 0.0102 1.9524 15.0864 2.5716 206.8257 118.0370 32.5662 12.6050 8.7650 99.7645 14.6383 1.7095 69.9492 40.0765 33.7978 23.1847 22.1718 33.6062 37.0357 21.2088 0.2780 24.1192 6.1543 6.0501 2.0139 2.0310
temp: 298.150 k
press: 1.00000 atm
elementType: 35 16 16 7 7 7 6 6 6 6 6 6 6 6 6 6 6 6 1 1 1 1 1 1 1 1 1 1 1 1
symmnumber: 1
zpe: 585463.2 jmol-1
zpe.correction: 0.222991 hartree
zpe.thermalcorrener: 0.239381 hartree
zpe.thermalcorrenthalpy: 0.240325 hartree
zpe.thermalcorrgfe: 0.176723 hartree
zpe.sumelectzpe: -1437.017000 hartree
zpe.sumelectthermal: -1437.000610 hartree
zpe.sumelectthermalent: -1436.999666 hartree
zpe.sumelectthermalfe: -1437.063268 hartree
dipole: 6.3094 -0.2016 0.0836
dipole: 6.3131
quadrupole: -97.6211 -139.2236 -128.9403
quadrupole: -13.1504 -5.9357 9.6490
quadrupole: 24.3073 -17.2953 -7.0120 -13.1504 -5.9357 9.6490
hfenergy: -1437.2399908 hartree
pointgroup: C01 [X(C12H12Br1N3S2)]
dipole: 2.4393816 -0.2269251 -0.4087395 debye
polarizability: 265.8778225|-11.7747453|189.1784316|-11.8513467|43.9672934|153.9548178 unknown
InChI: InChI=1S/C12H12BrN3S2/c13-9-4-3-5-10(8-9)16-11(17)14-6-1-2-7-15(14)12(16)18/h3-5,8H,1-2,6-7H2
charge 0 multiplicity 1
30 atoms
Br -4.737076 0.986328 2.172033
S  0.372929 -2.693278 -0.931495
S  0.249527 2.702807 0.639277
N  2.10476 -0.662568 -0.248765
N  2.058571 0.652349 0.301131
N  -0.012452 0.006475 -0.176374
C  3.297887 -1.502329 -0.037415
C  3.280585 1.475582 0.331613
C  4.574698 -0.649514 -0.174841
C  4.490845 0.606328 0.72545
C  0.813317 -1.115352 -0.472672
C  0.753824 1.119708 0.273643
C  -1.445496 0.011594 -0.306732
C  -2.233181 0.417853 0.795255
C  -2.042966 -0.390209 -1.521575
C  -3.63241 0.41842 0.651004
C  -3.449373 -0.38659 -1.630966
C  -4.260592 0.020743 -0.546822
H  3.243311 -2.31181 -0.783687
H  3.241349 -1.965906 0.968956
H  3.088249 2.289472 1.049739
H  3.435106 1.934478 -0.666651
H  4.710159 -0.346822 -1.230881
H  5.44276 -1.271958 0.105263
H  4.404051 0.303768 1.786601
H  5.406437 1.215976 0.628614
H  -1.759289 0.73207 1.727372
H  -1.417202 -0.707994 -2.358992
H  -3.922006 -0.699253 -2.567387
H  -5.350521 0.028835 -0.634798
