program: Gaussian 09
title: 000187934
version: EM64L-G09RevD.01
frameworkgroup: C1[X(C12H12FN3OS)]
method: RPBEPBE
basis: SDD
operation: Freq
keyword: #p
keyword: freq=noraman
keyword: PBEPBE/SDD
title: #p freq=noraman PBEPBE/SDD
converged: YES YES NO NO
title: Mulliken charges:
elementType: S F O N N N C C C C C C C C C C C C H H H H H H H H H H H H
charge: 0.045170 -0.204940 -0.234757 -0.020045 -0.123574 -0.306932 -0.354419 -0.354881 -0.404148 -0.405235 -0.276184 0.217840 0.496604 -0.316099 -0.313607 -0.366176 -0.361998 0.325765 0.237366 0.264164 0.231760 0.259901 0.230241 0.217648 0.228802 0.218589 0.271702 0.280793 0.258236 0.258414
chargesum: 0.00000
title: Mulliken charges with hydrogens summed into heavy atoms:
elementType: S F O N N N C C C C C C C C C C C C
charge: 0.045170 -0.204940 -0.234757 -0.020045 -0.123574 -0.306932 0.147111 0.136779 0.043741 0.042156 -0.276184 0.217840 0.496604 -0.044397 -0.032814 -0.107940 -0.103584 0.325765
polarizability: 2.38767449e+02 2.87655693e+00 1.74695682e+02 4.25324707e-01 8.72086748e+00 9.78475872e+01
1716.lowfreq: -13.3000 -6.9233 -1.6026 0.0009 0.0012 0.0013 35.7400 51.0571 67.2042
frequency: 35.7356 51.0532 67.1996 87.1900 107.3579 144.5961 185.2793 197.0926 228.6675 245.8678 275.7998 290.1326 325.4166 344.2607 375.1464 413.0490 425.0220 432.0927 464.5764 494.5835 513.0779 572.3912 593.3777 599.7434 626.0163 669.5271 704.1544 717.5368 758.2298 801.7362 811.0482 824.5959 825.8408 856.7845 868.9368 912.3001 935.4172 946.7260 965.3038 979.3671 1004.9977 1045.3444 1081.4255 1087.4950 1113.2055 1119.0849 1146.4737 1158.4731 1171.5028 1202.0477 1221.3631 1251.7089 1257.0446 1283.0585 1298.8249 1321.7119 1336.1042 1345.8256 1350.8527 1355.9247 1362.0605 1380.3085 1399.7057 1418.1354 1460.7646 1463.1649 1475.2041 1479.4859 1499.6186 1604.1797 1615.2526 1679.0896 2964.5666 2970.0533 3000.2836 3002.7287 3067.4829 3073.9335 3086.9384 3088.6719 3170.7017 3171.9356 3188.8291 3193.0203
redmass: 6.0233 3.9532 7.4598 4.1887 4.2640 7.9319 4.8037 9.6588 2.9331 6.2776 3.4523 7.2988 9.1089 2.2635 6.6891 2.9565 5.9958 5.7673 2.6892 5.2683 2.6831 5.3784 6.5609 5.4551 6.6464 4.4589 8.1999 3.8388 5.5702 1.2892 4.6056 1.5280 1.7501 3.2990 2.7276 1.3980 1.3740 1.3669 2.3011 4.6799 3.0079 4.1604 1.5244 3.1837 1.3307 2.0555 2.6719 1.5120 1.4012 2.0009 3.3514 1.2846 1.4495 2.6978 1.4494 2.9152 1.5354 1.4260 1.6068 4.4930 1.4329 6.7920 5.8170 3.4525 1.0873 1.0909 1.0839 1.0851 2.7926 8.0322 6.4313 12.1935 1.0693 1.0690 1.0649 1.0602 1.0987 1.1006 1.0950 1.0967 1.0894 1.0895 1.0970 1.0977
irintensity: 2.0420 0.8321 1.2824 0.7094 1.2624 3.2040 1.0926 2.1162 6.5255 0.6953 14.8786 7.9065 5.3322 21.6542 0.5506 0.5955 2.3618 3.1818 2.1200 3.8017 24.2743 33.7622 9.1843 15.9664 1.3084 10.7608 5.3578 2.2748 6.5032 1.1997 20.1990 5.6895 65.2963 11.6660 5.0997 3.6747 7.8036 0.0259 13.3313 14.5969 11.3472 15.5925 4.1493 26.5376 18.7015 12.5881 6.7669 62.5582 1.5602 30.9422 137.9667 78.0748 95.1480 139.5960 32.3862 134.5074 26.4826 2.5574 17.7143 119.5662 1.7035 19.8476 108.2812 20.4880 12.3440 13.1801 16.6465 1.3540 233.6248 5.7840 8.3607 356.7373 43.7019 28.5497 23.2108 34.4757 37.0739 32.2660 2.4806 16.3900 3.0869 2.5840 0.9655 0.3184
temp: 298.150 k
press: 1.00000 atm
elementType: 16 9 8 7 7 7 6 6 6 6 6 6 6 6 6 6 6 6 1 1 1 1 1 1 1 1 1 1 1 1
symmnumber: 1
zpe: 595984.4 jmol-1
zpe.correction: 0.226998 hartree
zpe.thermalcorrener: 0.242300 hartree
zpe.thermalcorrenthalpy: 0.243244 hartree
zpe.thermalcorrgfe: 0.183604 hartree
zpe.sumelectzpe: -1200.565812 hartree
zpe.sumelectthermal: -1200.550510 hartree
zpe.sumelectthermalent: -1200.549566 hartree
zpe.sumelectthermalfe: -1200.609207 hartree
dipole: -6.9022 -0.8453 0.2799
dipole: 6.9594
quadrupole: -97.3642 -122.6720 -109.0493
quadrupole: 2.9777 -0.5318 5.6070
quadrupole: 12.3309 -12.9768 0.6459 2.9777 -0.5318 5.6070
hfenergy: -1200.7928102 hartree
pointgroup: C01 [X(C12H12F1N3O1S1)]
dipole: -2.7162353 -0.320677 0.1271068 debye
polarizability: 238.7791925|2.7622346|175.3843502|0.2974952|4.6615864|97.147176 unknown
InChI: InChI=1S/C12H12FN3OS/c13-9-3-5-10(6-4-9)16-11(17)14-7-1-2-8-15(14)12(16)18/h3-6H,1-2,7-8H2
charge 0 multiplicity 1
30 atoms
S  -0.440361 2.783471 -0.4561
F  5.616943 -0.050905 0.03363
O  -0.393401 -2.364679 0.2857
N  -2.143668 0.669537 -0.0183
N  -2.118691 -0.757078 0.013294
N  -0.014156 0.017679 -0.015647
C  -3.377222 1.335944 -0.47125
C  -3.289583 -1.483792 0.534732
C  -4.604214 0.65538 0.171271
C  -4.575321 -0.875451 -0.061311
C  -0.850984 1.15928 -0.142668
C  -0.791763 -1.187231 0.10992
C  1.423263 0.014099 -0.005716
C  2.116998 -1.008268 -0.698371
C  2.13414 1.010644 0.705644
C  3.526545 -1.037056 -0.68261
C  3.544068 0.995225 0.715614
C  4.207976 -0.02993 0.021056
H  -3.435751 1.28526 -1.578287
H  -3.283282 2.396335 -0.186591
H  -3.310186 -1.417818 1.642727
H  -3.154255 -2.541445 0.256045
H  -5.51808 1.095991 -0.265115
H  -4.619383 0.868846 1.257476
H  -5.450078 -1.356108 0.411504
H  -4.61997 -1.092435 -1.145771
H  1.561608 -1.784918 -1.228748
H  1.590776 1.798072 1.232098
H  4.085479 -1.8183 -1.204657
H  4.11675 1.756649 1.251931
