program: Gaussian 09
title: 000187928
version: EM64L-G09RevD.01
frameworkgroup: C1[X(C12H16N2O2)]
method: RPBEPBE
basis: SDD
operation: Freq
keyword: #p
keyword: freq=noraman
keyword: PBEPBE/SDD
title: #p freq=noraman PBEPBE/SDD
converged: NO YES NO NO
title: Mulliken charges:
elementType: O O N N C C C C C C C C C C C C H H H H H H H H H H H H H H H H
charge: -0.418534 -0.220737 -0.143022 0.003572 -0.143466 -0.448311 -0.409730 -0.369771 -0.393342 0.408259 -0.429759 -0.312888 -0.523826 0.166763 -0.202876 -0.336946 0.188897 0.219233 0.220898 0.193527 0.221875 0.242095 0.170441 0.213721 0.196571 0.281170 0.235015 0.287012 0.250780 0.231357 0.241504 0.380521
chargesum: 0.00000
title: Mulliken charges with hydrogens summed into heavy atoms:
elementType: O O N N C C C C C C C C C C C C
charge: -0.038013 -0.220737 -0.143022 0.003572 0.045430 -0.008180 0.005671 0.042765 0.016950 0.408259 0.086426 -0.025877 -0.273046 0.166763 0.028481 -0.095442
polarizability: 1.65123417e+02 -1.48865026e+01 1.36558020e+02 -3.90324320e+00 -8.32013870e+00 1.24622938e+02
1716.lowfreq: -23.0262 -12.6139 -8.5999 -0.0006 -0.0005 0.0003 34.0391 41.0953 45.4496
frequency: 34.0164 41.0203 45.3131 62.7810 89.8536 117.7909 181.7591 220.2478 237.7621 255.1466 308.2456 331.5791 345.4376 374.9928 399.9636 448.7347 484.5412 499.7549 536.9285 552.1803 602.9525 616.8511 633.6951 655.8019 727.7539 769.5028 800.4624 819.5041 832.9244 848.8366 878.1761 899.0931 925.4473 933.8158 953.7098 978.6388 989.6172 1005.9654 1006.8354 1027.6564 1033.4237 1051.2185 1076.8403 1101.6649 1109.4723 1120.2610 1143.3859 1181.4399 1191.8345 1209.0855 1222.6305 1242.7507 1252.3628 1262.7809 1278.9826 1291.1589 1307.4045 1320.4382 1334.6608 1338.6242 1348.4095 1350.7787 1373.7359 1382.7867 1414.5530 1440.5949 1451.8170 1457.1791 1462.2029 1465.8751 1474.7504 1556.6334 1584.1014 1679.5926 2813.8959 2832.2162 2868.2819 2969.6241 2989.0087 2992.7437 3037.5095 3038.1376 3050.6277 3054.7195 3059.6255 3108.2024 3129.5032 3140.2561 3163.8804 3518.3835
redmass: 9.9672 4.8984 6.1477 3.1260 3.7130 3.6775 3.4153 2.6297 3.6411 5.0195 2.2424 4.4612 2.2294 2.9071 3.3495 2.9133 2.7237 1.9589 4.1538 2.5421 5.5345 4.1373 1.5018 4.6581 1.9770 3.3543 2.6438 1.6519 1.6913 4.1155 2.7291 1.7978 1.5473 1.7435 1.5059 2.1490 2.2283 1.9257 2.0686 2.9998 2.4694 2.1844 1.6191 1.8262 2.4989 2.0163 1.8290 1.7088 1.5176 1.5351 1.6804 1.4085 1.3901 1.3930 1.5592 1.3394 3.7239 1.5054 1.3445 1.4025 1.4534 1.4404 1.5103 1.4746 1.9906 1.1112 1.1247 1.8619 1.1443 1.0902 1.0946 5.5473 5.9404 8.4489 1.0799 1.0718 1.0704 1.0634 1.0611 1.0612 1.0876 1.0928 1.1019 1.0894 1.1026 1.0908 1.0877 1.0920 1.0999 1.0641
irintensity: 1.7870 0.6041 1.6152 1.1605 0.3523 1.2188 1.4172 1.3305 1.7957 0.6646 4.4276 2.9566 4.9441 0.1977 3.3203 8.1915 4.6510 25.1923 10.7211 15.6347 5.0227 15.3297 116.5078 4.7761 34.0281 14.4764 1.8833 38.2430 0.3367 1.3828 3.5951 1.1988 0.9371 4.4960 3.4401 38.3875 26.1534 10.3977 1.8151 71.9679 246.6361 18.8196 28.5049 7.5677 15.1022 7.4233 10.7174 6.2579 0.9840 11.6615 6.4740 15.5163 3.1830 0.3750 19.4487 8.7238 1.0185 19.0847 0.1575 0.7682 0.9966 3.8377 12.9007 13.6988 21.4479 19.7617 2.1899 21.8311 14.8217 9.0523 3.6970 7.6124 0.3042 191.5294 39.0667 116.7400 84.5126 40.6913 23.5628 33.3440 38.0065 24.6965 31.8562 15.7117 60.2141 23.2185 4.3212 13.8585 23.7193 27.0682
temp: 298.150 k
press: 1.00000 atm
elementType: 8 8 7 7 6 6 6 6 6 6 6 6 6 6 6 6 1 1 1 1 1 1 1 1 1 1 1 1 1 1 1 1
symmnumber: 1
zpe: 692370.7 jmol-1
zpe.correction: 0.263710 hartree
zpe.thermalcorrener: 0.278327 hartree
zpe.thermalcorrenthalpy: 0.279271 hartree
zpe.thermalcorrgfe: 0.220461 hartree
zpe.sumelectzpe: -725.611135 hartree
zpe.sumelectthermal: -725.596519 hartree
zpe.sumelectthermalent: -725.595574 hartree
zpe.sumelectthermalfe: -725.654384 hartree
dipole: -1.7988 0.4233 0.0156
dipole: 1.8480
quadrupole: -104.1010 -85.9967 -96.5616
quadrupole: -1.2524 12.0389 -2.6283
quadrupole: -8.5479 9.5564 -1.0085 -1.2524 12.0389 -2.6283
hfenergy: -725.8748454 hartree
pointgroup: C01 [X(C12H16N2O2)]
dipole: 0.6953324 -0.210936 0.0255704 debye
polarizability: 162.7294069|-17.2193717|137.4698029|5.1082069|8.0724208|126.1051652 unknown
InChI: InChI=1S/C12H16N2O2/c15-12(16)9-14-7-2-1-5-11(14)10-4-3-6-13-8-10/h3-4,6,8,11,15H,1-2,5,7,9H2
charge 0 multiplicity 1
32 atoms
O  2.349161 3.193066 -0.399203
O  2.745539 1.704432 1.339219
N  1.166512 -0.306228 -0.052428
N  -3.553672 0.498693 -0.994177
C  -0.043813 -1.011273 -0.574781
C  -0.16055 -2.423238 0.068512
C  1.121733 -3.258534 -0.116731
C  2.421381 -1.093984 -0.212637
C  2.325972 -2.478655 0.449049
C  -1.31847 -0.230262 -0.270892
C  1.316536 1.047477 -0.606273
C  -1.54413 0.336364 1.010176
C  -2.354582 -0.113873 -1.22993
C  2.205554 1.949596 0.242375
C  -2.771952 0.978769 1.272814
C  -3.747155 1.032205 0.247897
H  0.028025 -1.15166 -1.687259
H  -1.037692 -2.933731 -0.371185
H  -0.362962 -2.293448 1.149329
H  1.284978 -3.46532 -1.19485
H  1.012952 -4.237454 0.386745
H  3.240815 -0.515919 0.247833
H  2.663948 -1.225421 -1.300955
H  2.209446 -2.348949 1.541878
H  3.271023 -3.027489 0.275427
H  0.330574 1.543542 -0.663388
H  1.727299 1.062247 -1.647256
H  -0.752136 0.279513 1.765534
H  -2.224661 -0.528493 -2.238356
H  -2.977172 1.429419 2.249248
H  -4.715518 1.518015 0.414358
H  2.910917 3.788888 0.166803
