program: Gaussian 09
title: 000187924
version: EM64L-G09RevD.01
frameworkgroup: C1[X(C9H17NS)]
method: RPBEPBE
basis: SDD
operation: Freq
keyword: #p
keyword: freq=noraman
keyword: PBEPBE/SDD
title: #p freq=noraman PBEPBE/SDD
converged: YES YES NO NO
title: Mulliken charges:
elementType: S N C C C C C C C C C H H H H H H H H H H H H H H H H H
charge: 0.156513 -0.019500 -0.379389 -0.365229 -0.363652 -0.336366 -0.380238 -0.683744 -0.430298 -0.157953 -0.843562 0.199108 0.198984 0.192467 0.192515 0.195494 0.195555 0.215169 0.214989 0.222414 0.222462 0.248727 0.248757 0.247889 0.247877 0.253460 0.254127 0.253423
chargesum: 0.00000
title: Mulliken charges with hydrogens summed into heavy atoms:
elementType: S N C C C C C C C C C
charge: 0.156513 -0.019500 0.018703 0.019753 0.027397 0.093792 0.064638 -0.186260 0.065468 -0.157953 -0.082552
polarizability: 1.73478438e+02 8.13434646e+00 1.01045373e+02 -4.10876852e-02 1.64535753e-02 8.34291761e+01
1716.lowfreq: -3.3296 -0.0033 -0.0029 -0.0024 6.1849 22.2897 22.5261 39.7304 49.5425
frequency: 22.3174 39.7093 46.1294 55.0745 97.2652 99.2224 102.5414 144.6915 146.9020 160.5879 161.5631 179.8114 258.7506 318.1569 372.9723 403.9271 453.8292 541.2593 664.1263 709.0686 727.7802 736.7199 760.9846 811.5328 889.0637 919.6063 962.6275 965.5729 982.4735 998.8269 1013.8588 1046.2026 1061.3830 1070.2736 1078.4772 1086.0223 1120.2634 1206.0930 1210.8300 1243.7804 1247.1639 1276.9424 1279.7336 1286.1740 1299.6223 1301.3074 1311.8253 1337.5191 1347.0209 1356.6131 1358.9266 1448.3955 1449.2135 1453.6288 1462.4979 1465.2131 1466.2144 1472.1121 1481.7061 1489.4926 2197.0584 2956.7479 2957.8129 2967.8345 2981.0395 2986.6253 2994.2790 2994.7049 2997.7981 2999.2590 3005.1233 3026.8115 3036.5446 3043.9978 3067.2750 3071.1539 3109.5478 3128.0939
redmass: 3.9274 5.3964 2.9003 2.8460 2.1640 4.4316 2.1405 1.9894 1.7335 1.2504 5.6191 4.4758 4.5512 4.0443 3.5190 4.3330 3.2722 5.3366 6.8654 5.4298 1.0667 1.0936 1.1413 1.2401 1.2928 5.5649 1.1886 1.5043 1.2434 4.5382 3.2159 3.3771 1.1280 2.8125 2.2669 3.8660 1.3342 1.5347 1.2085 1.2539 1.3078 1.2888 1.1740 1.0363 1.0873 1.1131 1.3306 1.3096 1.2451 1.4757 1.6270 1.0820 1.0536 1.0869 1.0559 1.0716 1.0655 1.0857 1.0975 1.1001 12.4309 1.0590 1.0588 1.0592 1.0590 1.0590 1.0977 1.0535 1.0588 1.0313 1.1011 1.1030 1.1020 1.1050 1.1049 1.1081 1.1056 1.1022
irintensity: 0.2469 1.2293 0.0015 2.7055 0.1547 5.4629 2.9278 0.4590 0.0504 0.3258 0.1675 0.5352 1.2784 0.8042 0.5115 0.8980 1.0796 3.6076 1.1300 4.6554 13.7672 1.5307 4.7138 0.2774 0.1822 0.9325 5.1774 6.1567 2.4902 1.2516 2.8373 1.4211 0.7091 0.3872 0.2918 0.6074 0.1105 0.0663 14.0936 14.3791 0.0386 3.9216 0.4873 0.0245 0.1353 0.0061 11.3050 1.1988 0.3088 3.4768 0.5656 7.0015 16.0876 6.5138 10.7674 0.1019 0.6235 1.7259 0.4490 25.1943 16.1779 3.8674 4.3903 53.4665 22.1296 0.2786 2.5198 65.8530 53.6299 26.2683 0.1218 10.2912 0.4235 38.9948 41.8265 111.9176 24.2600 12.6316
temp: 298.150 k
press: 1.00000 atm
elementType: 16 7 6 6 6 6 6 6 6 6 6 1 1 1 1 1 1 1 1 1 1 1 1 1 1 1 1 1
symmnumber: 1
zpe: 633921.0 jmol-1
zpe.correction: 0.241448 hartree
zpe.thermalcorrener: 0.256305 hartree
zpe.thermalcorrenthalpy: 0.257249 hartree
zpe.thermalcorrgfe: 0.196703 hartree
zpe.sumelectzpe: -805.055932 hartree
zpe.sumelectthermal: -805.041075 hartree
zpe.sumelectthermalent: -805.040130 hartree
zpe.sumelectthermalfe: -805.100677 hartree
dipole: 3.6004 3.6455 0.0034
dipole: 5.1237
quadrupole: -118.3295 -77.6582 -75.8319
quadrupole: -3.8623 0.0790 0.0015
quadrupole: -27.7229 12.9483 14.7746 -3.8623 0.0790 0.0015
hfenergy: -805.2973797 hartree
pointgroup: C01 [X(C9H17N1S1)]
dipole: -1.4436408 1.4067727 -0.0205921 debye
polarizability: 173.7612752|-6.7501601|100.756021|-0.2532785|-0.2947215|83.4356912 unknown
InChI: InChI=1S/C9H17NS/c1-11-9-7-5-3-2-4-6-8-10/h2-7,9H2,1H3
charge 0 multiplicity 1
28 atoms
S  -5.248008 -0.851912 0.045503
N  6.224949 -0.623609 -0.005737
C  0.11118 -0.332491 0.007175
C  -1.21589 0.460354 0.001197
C  1.359372 0.578459 -0.007301
C  -2.460265 -0.459141 0.020007
C  2.68047 -0.221479 -0.001628
C  -3.774224 0.340465 0.011555
C  3.91984 0.717596 -0.015199
C  5.198487 -0.014446 -0.010177
C  -6.639543 0.415122 0.023271
H  0.138416 -1.007704 -0.872761
H  0.143297 -0.985947 0.903255
H  -1.242862 1.136826 0.880678
H  -1.250231 1.111212 -0.897173
H  1.33117 1.252779 0.873965
H  1.326064 1.231868 -0.904024
H  -2.435137 -1.134037 -0.858519
H  -2.4290 -1.104968 0.919991
H  2.724782 -0.870083 0.893927
H  2.72039 -0.890194 -0.882464
H  -3.855416 0.959258 -0.900852
H  -3.844012 0.996538 0.898512
H  3.89402 1.387423 0.866388
H  3.88976 1.367587 -0.911405
H  -6.58516 1.062726 0.913493
H  -7.583803 -0.151143 0.03896
H  -6.591648 1.023538 -0.894537
