program: Gaussian 09
title: 000187921
version: EM64L-G09RevD.01
frameworkgroup: C1[X(C2H3NO3S)]
method: RPBEPBE
basis: SDD
operation: Freq
keyword: #p
keyword: freq=noraman
keyword: PBEPBE/SDD
title: #p freq=noraman PBEPBE/SDD
converged: YES YES NO NO
title: Mulliken charges:
elementType: S O O O N C C H H H
charge: 0.203478 -0.403345 -0.211381 -0.080939 -0.024326 -0.739460 0.274360 0.301383 0.294042 0.386189
chargesum: 0.00000
title: Mulliken charges with hydrogens summed into heavy atoms:
elementType: S O O O N C C
charge: 0.203478 -0.017156 -0.211381 -0.080939 -0.024326 -0.144035 0.274360
polarizability: 9.33158311e+01 1.38018287e+01 5.57856918e+01 -1.46619938e+00 3.16112638e+00 3.70907673e+01
1716.lowfreq: -15.5234 -4.5594 -0.0016 0.0019 0.0026 6.7950 25.2554 40.3965 170.4529
frequency: 24.9862 40.2553 170.4461 177.7131 218.9278 321.9792 401.6061 508.9683 579.2888 610.1405 661.8038 750.9896 846.1345 885.7912 1062.1499 1182.1415 1246.7508 1313.2021 1420.3736 1548.3767 1667.6291 3035.8480 3135.7796 3518.3405
redmass: 9.2235 9.4545 8.1995 7.8951 12.4590 14.3175 2.4409 4.3531 3.0824 5.3008 1.8103 6.6749 5.0045 1.8802 1.8575 1.1699 1.1897 2.1985 1.1153 14.7042 8.8755 1.0588 1.1054 1.0641
irintensity: 0.9260 0.1911 2.4204 1.7446 0.3628 34.8511 1.9169 25.0428 65.9822 84.2680 118.5971 5.9115 29.1813 14.2752 238.6767 39.3539 7.2404 63.5045 27.3673 517.1696 231.5434 6.7864 0.7063 33.9824
temp: 298.150 k
press: 1.00000 atm
elementType: 16 8 8 8 7 6 6 1 1 1
symmnumber: 1
zpe: 151504.8 jmol-1
zpe.correction: 0.057705 hartree
zpe.thermalcorrener: 0.065694 hartree
zpe.thermalcorrenthalpy: 0.066638 hartree
zpe.thermalcorrgfe: 0.022918 hartree
zpe.sumelectzpe: -755.887728 hartree
zpe.sumelectthermal: -755.879740 hartree
zpe.sumelectthermalent: -755.878796 hartree
zpe.sumelectthermalfe: -755.922515 hartree
dipole: -1.4585 -1.2896 0.9547
dipole: 2.1684
quadrupole: -43.7012 -53.4675 -44.3892
quadrupole: 1.1387 2.2311 0.2647
quadrupole: 3.4848 -6.2815 2.7967 1.1387 2.2311 0.2647
hfenergy: -755.9454335 hartree
pointgroup: C01 [X(C2H3N1O3S1)]
dipole: 0.5556265 0.419818 -0.4927612 debye
dipolederiv: -0.5435633 0.0382622 0.2710649 0.3216627 0.0088488 -0.0664211 0.5378702 0.0487451 -0.2898886 -1.0417437 -0.0199958 0.4754945 0.101582 -0.3768365 -0.1261317 0.4122801 -0.0765482 -0.5784906 -0.6211276 0.0545701 -0.099774 0.1387844 -0.3097046 0.1711866 0.006449 0.0178248 -0.9306569 -1.506896 -0.1547348 0.5885353 -0.9526705 -0.1597142 0.3653525 0.0247636 -0.0220516 -0.0532734 1.9338297 0.1100461 -0.8919816 0.7299924 0.0915277 -0.2844747 -0.5312119 0.0300856 0.2880209 -0.1632697 0.1025807 -0.1042055 0.1191304 0.128515 -0.0088073 -0.1185104 0.0154838 -0.0369171 1.5534015 -0.1709356 -0.2067566 -0.4710014 0.1667309 -0.1670293 -0.1734393 -0.0684694 1.3148782 0.0289091 0.0401188 0.0325071 -0.0219197 0.0593293 -0.0121871 -0.0217061 -0.0876481 0.0435278 0.0585854 -0.0734905 0.0217957 -0.0512582 0.0355492 0.0518824 -0.0185573 0.0604844 0.0406504 0.3018744 0.0735788 -0.0866799 0.085698 0.3557543 0.0766296 -0.1179381 0.0820937 0.2021493 unknown
polarizability: 93.8391582|7.8859279|38.6886939|-11.7903792|2.828627|53.6644381 unknown
InChI: InChI=1S/C2H3NO3S/c4-2(5)1-7-3-6/h4H,1H2
charge 0 multiplicity 1
10 atoms
S  -0.72125 -0.480438 -1.101961
O  2.63369 0.102335 -0.528633
O  1.600674 0.012565 1.555169
O  -3.187086 -0.652407 0.271332
N  -2.159994 0.011013 0.257033
C  0.370382 0.883513 -0.401565
C  1.555069 0.301206 0.341703
H  -0.272117 1.438977 0.303169
H  0.699489 1.521419 -1.233444
H  3.390942 -0.311783 -0.032102
