program: Gaussian 09
title: 000187907
version: EM64L-G09RevD.01
frameworkgroup: C1[X(C17H15NO3)]
method: RPBEPBE
basis: SDD
operation: Freq
keyword: #p
keyword: freq=noraman
keyword: PBEPBE/SDD
title: #p freq=noraman PBEPBE/SDD
converged: YES YES NO NO
title: Mulliken charges:
elementType: O O O N C C C C C C C C C C C C C C C C C H H H H H H H H H H H H H H H
charge: -0.252850 -0.204389 -0.193116 -0.304845 0.051142 0.285167 -0.702433 0.120340 0.272054 0.366877 -0.435459 -0.682369 -0.342108 -0.427859 -0.437354 -0.238477 -0.274761 -0.234761 0.257156 0.301563 -0.744347 0.244254 0.245728 0.245522 0.264600 0.258587 0.259406 0.241993 0.242779 0.230410 0.231939 0.226989 0.356379 0.254581 0.270526 0.247138
chargesum: 0.00000
title: Mulliken charges with hydrogens summed into heavy atoms:
elementType: O O O N C C C C C C C C C C C C C C C C C
charge: -0.252850 -0.204389 -0.193116 0.051534 0.051142 0.285167 -0.212452 0.120340 0.272054 0.366877 -0.189937 -0.159182 -0.082703 -0.185866 -0.194576 -0.008067 -0.042822 -0.007772 0.257156 0.301563 0.027899
polarizability: 2.19984103e+02 1.32640435e+01 2.48950402e+02 3.10472156e+01 -8.03491636e+00 1.37380150e+02
1716.lowfreq: -7.4340 -0.0004 -0.0002 0.0003 5.1622 8.2531 19.9715 25.8799 44.9163
frequency: 19.8921 25.8363 44.9061 63.1508 76.1536 79.9818 89.0769 94.7731 117.4575 204.1357 210.1758 240.0342 274.4828 296.4051 303.8428 317.9578 339.7463 393.1606 400.2450 423.3465 429.6889 470.5833 491.8413 518.7193 537.4934 541.5521 570.0191 577.1079 590.8758 621.5506 628.2396 693.3278 697.9872 727.0032 745.0021 751.0424 774.2492 786.5837 800.0150 825.7209 873.7309 894.4736 908.4698 925.5803 941.9199 966.9956 980.2032 982.4406 992.0058 992.3111 994.8033 1014.8593 1035.8309 1039.4248 1076.5380 1106.6757 1131.3828 1144.7982 1162.3565 1173.8098 1178.3854 1181.8998 1201.3531 1207.1217 1236.1962 1246.9677 1278.8932 1299.7672 1311.1802 1377.9336 1384.6974 1390.8200 1413.7486 1427.1875 1433.1673 1451.3245 1453.3975 1453.9652 1460.9361 1466.7381 1481.2674 1586.5989 1592.1820 1608.6392 1619.1166 1625.1385 1725.8617 2980.9894 3008.1498 3009.9681 3024.9073 3071.5150 3104.2969 3118.9866 3123.4055 3131.0996 3137.6574 3141.9312 3156.6384 3157.6897 3175.4102 3544.7028
redmass: 6.1953 6.5602 4.1887 7.5137 3.6192 3.6657 1.5164 3.3976 4.3832 4.2550 4.2443 2.1781 5.4048 6.3967 4.3610 3.8252 4.6030 1.3564 3.4025 6.1910 2.8924 2.9416 3.7142 3.5216 4.5369 3.9013 3.3435 3.2695 4.4626 5.6238 6.0078 4.5436 4.5806 3.1855 6.3971 1.4766 3.3063 1.5371 2.9906 4.9987 1.3727 2.6070 1.6835 2.9084 1.5751 1.6391 1.4588 2.4232 2.8305 1.6494 5.8410 6.6028 2.2180 1.6299 1.9373 1.9673 1.1497 2.5704 1.4666 1.2581 1.1308 1.3651 1.8045 1.9518 2.1659 2.8817 2.0153 1.6393 1.5381 7.3355 1.2200 3.1052 1.7113 1.2063 2.5771 1.0581 1.0590 2.4294 2.0160 1.5542 2.5913 6.2016 7.5874 7.2399 7.0552 9.9292 10.9500 1.0609 1.0623 1.0375 1.0991 1.0982 1.0948 1.0875 1.0867 1.0909 1.0904 1.1026 1.0961 1.0986 1.0965 1.0812
irintensity: 1.3666 0.1471 0.9506 5.4221 5.1802 9.0131 0.5727 0.8665 1.0867 7.5067 4.0272 7.2663 1.0850 0.6123 11.7859 3.0015 4.1866 85.5835 31.8222 2.7614 3.6151 1.6602 3.0215 1.7411 0.8079 1.1907 0.5667 0.8139 4.3860 7.2850 3.2951 1.9259 13.9317 0.8017 83.2574 129.8533 13.5664 2.3531 8.1464 0.3181 1.7248 6.7481 0.6288 2.1187 1.7635 7.9228 3.7773 32.8458 3.3276 2.2234 3.1894 70.0035 2.7887 9.7702 7.7775 0.7686 0.0126 223.3166 20.0846 1.8155 0.4101 3.1928 10.4555 2.7478 3.1768 1.3922 1.4505 5.4941 2.2269 10.0493 49.4827 4.5853 138.4414 18.5582 19.4725 19.5062 16.9960 23.0406 4.3908 17.4111 0.7930 1.5697 9.7090 8.7271 0.8014 169.0051 178.2452 13.9098 11.8797 0.3836 7.3151 3.1183 5.4626 5.7850 3.1607 14.1991 15.0359 6.4291 39.6194 21.9372 9.9156 39.4828
temp: 298.150 k
press: 1.00000 atm
elementType: 8 8 8 7 6 6 6 6 6 6 6 6 6 6 6 6 6 6 6 6 6 1 1 1 1 1 1 1 1 1 1 1 1 1 1 1
symmnumber: 1
zpe: 730402.8 jmol-1
zpe.correction: 0.278196 hartree
zpe.thermalcorrener: 0.296767 hartree
zpe.thermalcorrenthalpy: 0.297711 hartree
zpe.thermalcorrgfe: 0.229203 hartree
zpe.sumelectzpe: -935.742372 hartree
zpe.sumelectthermal: -935.723801 hartree
zpe.sumelectthermalent: -935.722856 hartree
zpe.sumelectthermalfe: -935.791365 hartree
dipole: -2.1935 1.3635 -3.2636
dipole: 4.1620
quadrupole: -112.1712 -111.9158 -120.8492
quadrupole: -3.5029 -5.5093 1.5708
quadrupole: 2.8076 3.0629 -5.8705 -3.5029 -5.5093 1.5708
hfenergy: -936.0205674 hartree
pointgroup: C01 [X(C17H15N1O3)]
dipole: -0.9373179 0.0262968 1.342377 debye
polarizability: 214.6098068|-14.6081321|244.4268962|-30.5575888|-30.5324676|147.2779518 unknown
InChI: InChI=1S/C17H15NO3/c1-11(19)21-18-16(20)10-14-7-4-6-13-9-12-5-2-3-8-15(12)17(13)14/h2-8,18H,9-10H2,1H3
charge 0 multiplicity 1
36 atoms
O  2.631538 0.238867 -1.777293
O  3.149977 0.178568 0.972626
O  4.559357 -1.579794 0.23923
N  2.065406 -0.521642 0.351535
C  -1.384477 -0.495099 -0.142796
C  -2.444089 -0.815416 0.764615
C  -3.328283 0.400774 0.994143
C  -1.513842 0.933955 -0.521581
C  -2.665722 1.469691 0.139144
C  -0.451785 -1.500365 -0.530055
C  -2.577749 -2.103497 1.309393
C  0.666595 -1.239539 -1.525333
C  -0.729491 1.774002 -1.351445
C  -3.043844 2.811432 -0.03492
C  -0.6026 -2.796377 0.031559
C  -1.642008 -3.100111 0.941532
C  -1.115185 3.123593 -1.523246
C  -2.263161 3.64183 -0.87665
C  1.871589 -0.418212 -1.015115
C  4.441346 -0.460893 0.748997
C  5.507244 0.4901 1.228308
H  -3.366607 0.690204 2.062833
H  -4.374177 0.209009 0.68254
H  -3.393368 -2.337008 2.003138
H  1.086553 -2.198525 -1.883356
H  0.300407 -0.705537 -2.418847
H  0.175673 1.417293 -1.849871
H  -3.927381 3.214434 0.473737
H  0.102481 -3.583881 -0.262383
H  -1.726704 -4.112755 1.350407
H  -0.510428 3.777115 -2.161467
H  -2.543477 4.690979 -1.022735
H  1.445199 -1.012751 0.999062
H  5.137686 1.122961 2.049818
H  5.788985 1.152247 0.389487
H  6.396841 -0.075855 1.543087
