program: Gaussian 09
title: 000187904
version: EM64L-G09RevD.01
frameworkgroup: C1[X(C14H11ClOS)]
method: RPBEPBE
basis: SDD
operation: Freq
keyword: #p
keyword: freq=noraman
keyword: PBEPBE/SDD
title: #p freq=noraman PBEPBE/SDD
converged: NO NO NO NO
title: Mulliken charges:
elementType: Cl S O C C C C C C C C C C C C C C H H H H H H H H H H H
charge: -0.027710 0.227527 -0.274864 -0.263711 -0.288178 0.578621 0.460885 0.489809 -0.472801 -0.441806 0.462690 -0.304059 -0.365001 -0.423416 -0.392008 -0.804737 -0.806383 0.246838 0.243660 0.265483 0.261781 0.239176 0.228562 0.240291 0.227697 0.238231 0.226278 0.227148
chargesum: 0.00000
title: Mulliken charges with hydrogens summed into heavy atoms:
elementType: Cl S O C C C C C C C C C C C C C C
charge: -0.027710 0.227527 -0.274864 -0.263711 -0.288178 0.578621 0.460885 0.489809 -0.225963 -0.198146 0.462690 -0.304059 -0.099517 -0.161636 -0.152832 -0.108187 -0.114726
polarizability: 2.97833509e+02 -1.06519261e+01 1.95959432e+02 -2.27331177e-02 -2.46960038e-01 7.58088555e+01
1716.lowfreq: -26.0420 -0.0016 -0.0015 0.0011 4.8806 8.5506 9.4226 42.2927 50.9905
frequency: -26.0300 42.1450 50.8214 65.2544 124.4103 139.1921 147.3063 164.1722 190.3435 195.6335 244.6041 295.9258 330.4111 339.0402 349.2159 389.1684 424.7951 440.2643 443.4186 465.7754 501.0985 505.4992 542.6903 555.8496 598.7832 670.6688 699.5411 706.3831 713.3246 768.6249 807.5506 821.7283 852.8605 872.8776 874.2768 883.0928 906.9309 951.7154 997.4742 1004.0997 1042.9936 1046.0005 1047.9275 1057.3752 1136.2010 1189.4665 1207.8138 1214.6029 1230.8756 1259.9796 1269.9966 1358.9625 1374.4239 1382.2192 1396.9217 1398.7833 1399.1976 1452.4305 1471.0632 1473.3194 1474.1365 1474.4851 1485.1835 1565.0301 1593.1391 1597.1436 1616.2564 2976.1174 2978.5710 3057.5210 3060.7689 3086.3820 3089.2376 3124.2167 3130.8734 3138.3167 3158.7451 3169.4556
redmass: 6.8928 1.0144 1.0143 5.7075 7.2774 6.4327 4.1292 4.6115 4.6959 4.9812 3.8463 6.5832 4.7731 5.8252 4.5402 7.1794 7.7594 3.4539 7.1124 5.3101 5.3052 5.9698 3.7614 3.5500 5.2263 7.1939 3.7830 4.7584 6.7640 10.6164 5.4932 1.3523 1.3659 1.7477 3.0505 1.3590 7.3459 1.3424 1.4198 1.3891 2.5481 1.5543 1.8559 3.5211 1.3068 2.0329 1.8292 1.6329 3.6137 8.9784 1.4300 5.7960 5.4930 3.4322 3.5531 1.2181 1.2643 3.7277 1.1024 1.0752 1.0563 1.0807 3.1306 6.6734 7.0836 6.8774 7.1057 1.0385 1.0384 1.0953 1.0955 1.0997 1.0999 1.0916 1.0917 1.0894 1.0926 1.0957
irintensity: 1.5405 0.5230 0.5627 0.0111 1.2567 0.3808 1.4226 0.7964 0.0164 0.6206 0.3619 0.1059 1.3309 1.0587 0.7490 1.1766 0.1775 5.3198 2.7489 0.0484 0.3796 1.2571 6.3732 2.3619 0.2397 10.7959 0.0783 13.1929 0.7844 61.4393 35.7614 53.6666 28.4733 2.1722 3.8252 0.1132 8.2434 1.9123 1.7377 5.6539 7.7518 14.6614 24.6004 11.0457 13.1348 8.7022 70.3383 12.5959 25.2671 248.5605 6.0796 25.0603 1.7209 9.8593 5.8868 9.5649 11.8519 269.3837 27.1816 28.8511 8.5971 29.2621 96.8444 51.2567 24.9677 6.7739 1.2170 45.2599 38.0285 21.5708 20.0985 16.9704 16.3944 6.4104 4.7756 15.2360 2.1390 3.2129
temp: 298.150 k
press: 1.00000 atm
elementType: 17 16 8 6 6 6 6 6 6 6 6 6 6 6 6 6 6 1 1 1 1 1 1 1 1 1 1 1
symmnumber: 1
zpe: 539893.2 jmol-1
zpe.correction: 0.205634 hartree
zpe.thermalcorrener: 0.220570 hartree
zpe.thermalcorrenthalpy: 0.221514 hartree
zpe.thermalcorrgfe: 0.162783 hartree
zpe.sumelectzpe: -1472.239821 hartree
zpe.sumelectthermal: -1472.224885 hartree
zpe.sumelectthermalent: -1472.223941 hartree
zpe.sumelectthermalfe: -1472.282672 hartree
dipole: -0.6246 -2.0242 0.1133
dipole: 2.1214
quadrupole: -86.7913 -110.1513 -118.4142
quadrupole: -6.9589 -0.0279 -0.1243
quadrupole: 18.3276 -5.0324 -13.2952 -6.9589 -0.0279 -0.1243
hfenergy: -1472.445455 hartree
pointgroup: C01 [X(C14H11Cl1O1S1)]
dipole: 0.1871508 0.8122499 0.0424593 debye
polarizability: 298.8401225|-3.1467826|194.9532995|0.0170521|-0.0644842|75.8083748 unknown
InChI: InChI=1S/C14H11ClOS/c1-8-3-4-11-12(6-8)17-13-7-9(2)5-10(15)14(13)16-11/h3-7H,1-2H3
charge 0 multiplicity 1
28 atoms
Cl -2.248951 -3.070058 0.003446
S  0.240959 2.000104 -0.014338
O  0.057413 -1.253369 0.006037
C  -1.230851 0.902327 -0.00885
C  1.582388 0.747122 -0.008159
C  -1.13728 -0.510121 -0.000053
C  1.338431 -0.643874 0.000692
C  -3.693913 0.775223 -0.014197
C  -2.49497 1.52918 -0.018639
C  2.914249 1.214495 -0.017102
C  4.014149 0.320395 -0.012461
C  -2.336534 -1.258728 -0.000381
C  2.416351 -1.549102 0.000751
C  -3.598048 -0.637089 -0.009347
C  3.742701 -1.071284 -0.007123
C  -5.047619 1.462467 0.010584
C  5.438905 0.846118 0.010935
H  -2.546727 2.624286 -0.029039
H  3.099858 2.295654 -0.027578
H  2.189383 -2.619261 0.002402
H  -4.500162 -1.256537 -0.012386
H  4.572232 -1.787028 -0.010442
H  -5.82839 0.829727 -0.44573
H  -5.364076 1.681524 1.048684
H  -5.023219 2.421974 -0.535312
H  5.767104 1.064621 1.045722
H  6.145103 0.109064 -0.409426
H  5.536812 1.781173 -0.568594
