program: Gaussian 09
title: 000187899
version: EM64L-G09RevD.01
frameworkgroup: C1[X(C22H16O2)]
method: RPBEPBE
basis: SDD
operation: Freq
keyword: #pfreq=noraman
keyword: PBEPBE/SDD
title: #p freq=noraman PBEPBE/SDD
converged: YES YES NO NO
title: Mulliken charges:
elementType: O O C C C C C C C C C C C C C C C C C C C C C C H H H H H H H H H H H H H H H H
charge: -0.289248 -0.203709 0.020597 0.259499 0.280137 0.178086 0.352215 -0.019163 -0.570638 -0.171044 -0.481145 0.500575 0.477483 -0.455402 -0.333556 -0.475699 -0.212232 -0.514795 -0.481167 -0.470517 -0.464771 -0.247026 0.264270 -0.761852 0.235570 0.255335 0.217356 0.226229 0.230138 0.220831 0.263897 0.222388 0.236175 0.238348 0.242634 0.241480 0.226782 0.260622 0.249220 0.252099
chargesum: 0.00000
title: Mulliken charges with hydrogens summed into heavy atoms:
elementType: O O C C C C C C C C C C C C C C C C C C C C C C
charge: -0.289248 -0.203709 0.020597 0.259499 0.280137 0.178086 0.352215 -0.019163 -0.079734 -0.171044 -0.037560 0.500575 0.477483 -0.225264 -0.112726 -0.211803 0.010156 -0.278620 -0.242819 -0.227883 -0.223291 -0.020244 0.264270 0.000089
polarizability: 4.31730580e+02 -4.14399634e+01 2.93812169e+02 1.01017500e+01 1.23442951e+01 1.17138072e+02
1716.lowfreq: -61.4420 -13.4968 -6.1734 -1.9048 -0.0007 -0.0004 0.0002 43.2242 50.0512
frequency: -61.4386 43.2170 50.0367 68.4997 72.3843 88.2626 123.8159 159.3074 196.2559 199.7421 210.9695 242.4070 285.8826 294.8837 316.0135 327.6855 355.4085 387.5962 399.4009 449.7889 470.1592 477.9244 497.3441 507.6241 516.7849 529.3895 538.1906 555.0629 561.0930 590.8064 601.0099 633.8846 646.7594 671.2256 694.4239 702.1269 742.1521 764.5108 768.7030 783.7981 790.3549 807.2499 833.8745 841.9086 867.1440 883.0465 888.5683 902.1092 914.8648 945.3299 959.6183 975.3326 984.2074 990.5441 993.4630 1001.1949 1028.1704 1035.9110 1043.1567 1057.3921 1086.2119 1121.0101 1135.5550 1154.2004 1164.9166 1167.6254 1176.5363 1192.7588 1204.0352 1232.1105 1244.7685 1257.9266 1299.6399 1317.1470 1329.1211 1337.1517 1356.1474 1381.7415 1383.2066 1402.6542 1413.1018 1415.5455 1426.6220 1438.7039 1452.4453 1455.3601 1458.2074 1458.5216 1469.0834 1484.5736 1495.5818 1543.7629 1585.8301 1598.9780 1605.2672 1629.8041 1638.8832 1669.6170 2948.4652 2972.1791 3008.1245 3035.6979 3046.4900 3097.0961 3121.7669 3122.7597 3127.2217 3128.7931 3132.7015 3139.6180 3152.7700 3156.9720 3167.1044 3167.9071
redmass: 1.0519 7.0053 4.8967 4.0671 4.0225 3.4481 3.6768 4.1816 4.3131 3.9862 3.3660 3.8072 4.5850 6.8425 3.9026 4.8838 4.0465 3.7535 3.7918 4.6505 4.0947 4.3907 6.2113 4.4057 4.4821 3.5885 4.6604 3.8414 3.6091 4.0857 5.7295 3.6045 3.7799 4.1876 4.6162 2.7155 2.7026 2.5106 1.2915 5.5854 2.2568 4.8231 1.5486 5.3160 3.0631 4.0235 3.1801 3.3346 1.4691 3.8027 1.2918 1.3412 1.3810 1.4093 1.9637 3.5311 2.1466 3.6695 1.6354 3.3697 2.0491 2.5154 1.7675 3.0285 1.1966 1.1697 1.3169 1.2887 1.7795 1.7325 1.2495 1.8332 2.0339 1.8054 2.2091 2.9964 2.1506 2.2637 1.4744 2.0592 3.8836 2.9836 4.5258 3.4656 1.0813 1.1413 1.0658 1.0937 4.1875 6.9430 3.5031 6.4351 6.9759 7.5441 6.6021 7.0886 7.0448 11.2820 1.0685 1.0638 1.0368 1.0910 1.0967 1.0966 1.0860 1.0861 1.0887 1.0888 1.0913 1.1016 1.0982 1.0991 1.0947 1.0939
irintensity: 0.8725 0.5466 0.2501 3.7217 1.3641 0.4306 0.9895 0.4493 0.8055 0.5324 7.3163 2.5569 2.2112 1.8049 2.7648 0.4015 1.3186 0.5796 1.3000 1.3393 2.6836 2.3335 1.0449 1.4470 1.6032 0.9004 11.2630 1.3799 4.0255 0.9827 5.6635 10.4570 26.5482 2.4349 3.4650 1.8668 13.0921 16.7041 16.3387 10.1655 37.5395 34.5012 0.2898 22.3679 64.2385 12.9929 26.2704 12.5928 0.0695 28.4206 1.1483 0.7007 0.5164 7.7598 52.2696 20.4736 10.7997 50.6530 8.3049 37.4483 37.1873 33.5740 5.4121 484.1843 2.6211 4.7158 14.5604 27.2940 7.8576 1.9888 7.4473 7.8702 25.3618 0.4183 2.2477 30.5859 3.9215 11.9157 49.2666 1.5283 6.4520 4.6387 3.2354 4.7599 12.5343 6.0675 22.5676 4.3186 4.0647 13.9970 1.0809 0.8397 5.9438 6.0540 5.8158 3.1392 1.4226 163.3648 44.9997 15.7440 2.5944 50.9782 17.1771 4.9930 4.0161 0.2746 8.1875 1.3286 25.9889 6.9792 13.4588 50.6243 48.0338 9.7030
temp: 298.150 k
press: 1.00000 atm
elementType: 8 8 6 6 6 6 6 6 6 6 6 6 6 6 6 6 6 6 6 6 6 6 6 6 1 1 1 1 1 1 1 1 1 1 1 1 1 1 1 1
symmnumber: 1
zpe: 819310.3 jmol-1
zpe.correction: 0.312059 hartree
zpe.thermalcorrener: 0.329898 hartree
zpe.thermalcorrenthalpy: 0.330843 hartree
zpe.thermalcorrgfe: 0.266430 hartree
zpe.sumelectzpe: -996.812045 hartree
zpe.sumelectthermal: -996.794205 hartree
zpe.sumelectthermalent: -996.793261 hartree
zpe.sumelectthermalfe: -996.857674 hartree
dipole: -0.7764 -0.2734 -1.5198
dipole: 1.7284
quadrupole: -115.1164 -115.2670 -150.0513
quadrupole: 2.0686 7.3247 3.9548
quadrupole: 11.6952 11.5446 -23.2398 2.0686 7.3247 3.9548
hfenergy: -997.1241034 hartree
pointgroup: C01 [X(C22H16O2)]
dipole: -0.309242 0.1164447 0.5943154 debye
polarizability: 437.0425075|31.2819655|288.1181542|-2.1448853|17.118286|117.5201589 unknown
InChI: InChI=1S/C22H16O2/c1-13(23)24-22-18-8-3-2-7-16(18)17-11-9-14-5-4-6-15-10-12-19(22)21(17)20(14)15/h2,4-7,9-12H,3,8H2,1H3
charge 0 multiplicity 1
40 atoms
O  -2.252756 1.925236 0.522382
O  -3.078075 1.970415 -1.676283
C  0.819168 -0.175269 0.074193
C  -2.030911 -0.493399 0.104711
C  0.23696 -1.483392 -0.12162
C  -1.190641 -1.634167 -0.103179
C  -0.028595 0.972024 0.278547
C  2.24755 0.000229 0.063361
C  -3.543449 -0.662829 0.068458
C  -1.43539 0.767613 0.272703
C  -4.004581 -2.039509 0.597091
C  3.115104 -1.133267 -0.140757
C  2.823822 1.309585 0.256242
C  1.139961 -2.599812 -0.315078
C  -1.842621 -2.940313 -0.298096
C  0.566098 2.273108 0.473425
C  -3.15459 -3.152072 0.017574
C  2.512984 -2.433308 -0.326285
C  1.94025 2.434035 0.462558
C  4.523281 -0.942964 -0.150688
C  4.238159 1.457221 0.23983
C  5.076976 0.341403 0.037876
C  -3.038359 2.461209 -0.533191
C  -3.780619 3.687382 -0.050054
H  -4.032664 0.144651 0.642135
H  -3.871307 -0.545186 -0.984887
H  -5.071657 -2.194526 0.352472
H  -3.931534 -2.06777 1.706208
H  0.730563 -3.604831 -0.446897
H  -1.249355 -3.772466 -0.689444
H  -0.095143 3.127796 0.639846
H  -3.598886 -4.14675 -0.11049
H  3.171492 -3.297138 -0.475341
H  2.38286 3.425693 0.612628
H  5.178651 -1.807688 -0.306944
H  4.672282 2.453253 0.385768
H  6.164431 0.472475 0.027271
H  -3.682199 3.814342 1.037377
H  -4.844654 3.605258 -0.32861
H  -3.376211 4.579628 -0.560712
