program: Gaussian 09
title: 000196134
version: EM64L-G09RevD.01
frameworkgroup: C1[X(C7H13FO5)]
method: RPBEPBE
basis: SDD
operation: Freq
keyword: #p
keyword: freq=noraman
keyword: PBEPBE/SDD
title: #p freq=noraman PBEPBE/SDD
converged: YES YES NO NO
title: Mulliken charges:
elementType: F O O O O O C C C C C C C H H H H H H H H H H H H H
charge: -0.222347 -0.273796 -0.435288 -0.415465 -0.249756 -0.429602 -0.180738 -0.131765 -0.095858 -0.073294 -0.004941 -0.382465 -0.504342 0.294054 0.205675 0.227107 0.253083 0.196029 0.225461 0.219648 0.349403 0.357037 0.379527 0.242575 0.241965 0.208093
chargesum: 0.00000
title: Mulliken charges with hydrogens summed into heavy atoms:
elementType: F O O O O O C C C C C C C
charge: -0.222347 -0.273796 -0.085885 -0.058428 -0.249756 -0.050075 0.113316 0.073910 0.131248 0.179789 0.191088 0.062644 0.188291
polarizability: 1.06155719e+02 2.23871839e+00 9.59493523e+01 -6.96457229e-01 1.49986066e-01 7.52268486e+01
1716.lowfreq: -11.7361 -5.4148 -0.0004 0.0009 0.0010 8.4773 57.1653 71.9699 85.8667
frequency: 57.1141 71.9665 85.8564 117.6174 130.4354 142.8135 175.3880 205.1363 222.5763 252.5134 267.5431 298.8391 329.0337 366.4736 373.8587 412.9787 424.4614 471.8695 498.6474 554.2113 577.8210 656.0841 673.1571 726.3428 805.2251 870.6437 889.9040 912.0409 950.4139 955.4345 964.7705 1014.9862 1034.6911 1038.2135 1071.6723 1082.4994 1103.9901 1113.2028 1128.4458 1161.9848 1189.4283 1196.8204 1223.8456 1244.9152 1247.5915 1268.2676 1287.9985 1313.6684 1323.0460 1351.2570 1358.9715 1371.5806 1382.3466 1391.1524 1399.9940 1434.8627 1456.8407 1468.5088 1476.3317 2904.1815 2925.5677 2964.9137 2967.0874 2984.7635 3071.6535 3071.7370 3095.6529 3097.0906 3133.3005 3459.0842 3512.0802 3553.8312
redmass: 3.6757 5.1422 2.9619 5.1316 1.2595 3.4333 5.1643 3.6510 6.1994 5.3637 5.4758 5.2445 5.0523 5.1522 1.1711 6.5565 4.4914 1.1720 4.3077 5.6552 3.3862 1.3283 3.1204 2.5348 3.9613 3.3370 8.4579 5.9196 4.5745 4.2771 2.8459 3.9098 4.6393 2.5802 2.8279 3.1364 2.0689 1.2797 2.9560 1.5682 1.1964 1.2556 1.3857 1.2243 1.3059 1.2032 1.1945 1.2443 1.6224 1.2788 1.4632 1.4274 1.4549 1.1773 1.1752 1.1869 1.0509 1.0739 1.0531 1.0829 1.0819 1.0812 1.0390 1.0666 1.0986 1.0868 1.0926 1.0917 1.1023 1.0656 1.0650 1.0659
irintensity: 1.4145 6.6111 2.7410 10.3370 1.3256 2.5525 0.7976 16.7442 5.8660 19.9299 0.1565 3.8815 4.0926 2.3081 152.5508 6.0487 8.0772 62.6606 25.5958 1.8288 21.7366 232.1742 20.7975 46.8134 38.9124 8.8821 143.3110 27.1514 44.6279 188.4920 13.7202 88.6540 92.5554 63.4049 8.2007 26.0252 10.2315 1.9017 78.5385 10.5819 36.7253 4.8037 22.9521 14.3822 17.9667 11.8502 5.2550 2.8308 12.6556 29.8152 23.8571 18.7073 3.3507 39.4459 12.7121 11.3424 13.4355 6.0810 13.0907 35.5318 41.8754 33.0528 74.4458 40.2939 38.9609 8.9188 11.1619 25.5836 19.3589 35.7184 8.4989 15.7172
temp: 298.150 k
press: 1.00000 atm
elementType: 9 8 8 8 8 8 6 6 6 6 6 6 6 1 1 1 1 1 1 1 1 1 1 1 1 1
symmnumber: 1
zpe: 540229.0 jmol-1
zpe.correction: 0.205762 hartree
zpe.thermalcorrener: 0.219698 hartree
zpe.thermalcorrenthalpy: 0.220643 hartree
zpe.thermalcorrgfe: 0.165377 hartree
zpe.sumelectzpe: -749.386252 hartree
zpe.sumelectthermal: -749.372316 hartree
zpe.sumelectthermalent: -749.371371 hartree
zpe.sumelectthermalfe: -749.426637 hartree
dipole: -2.8803 -2.1893 -1.9793
dipole: 4.1239
quadrupole: -92.3062 -74.9846 -73.3697
quadrupole: 5.0808 1.4721 -1.7108
quadrupole: -12.0860 5.2356 6.8505 5.0808 1.4721 -1.7108
hfenergy: -749.592014 hartree
pointgroup: C01 [X(C7H13F1O5)]
dipole: 0.0766228 1.5223671 0.5557811 debye
dipolederiv: -0.7597987 0.1504491 0.0806742 0.1532164 -0.3733001 -0.0227903 0.1845601 -0.0428906 -0.2974485 -0.781595 0.472462 -0.1318699 0.2011262 -0.9508589 0.0968067 -0.0338363 0.0157496 -0.390083 -0.679294 -0.0245364 -0.0146466 0.0176202 -0.2829873 -0.1593513 0.0759449 -0.2327055 -0.6466175 -0.585575 -0.3382607 -0.0856718 -0.3568272 -0.5744139 0.1486424 -0.0974572 0.1373284 -0.4728251 -0.4708369 -0.0351929 0.0384976 -0.0015518 -1.2263741 0.1710691 -0.005783 0.3435889 -0.4598475 -0.6223139 0.1013563 0.1526292 0.1334615 -0.7436449 -0.0049996 0.1561849 -0.0381696 -0.3534122 0.2753381 -0.1128522 -0.0277625 0.0025942 0.1457389 0.0660702 -0.1912792 0.17705 0.4824267 0.3971311 0.2799422 0.10884 0.339383 0.3876373 -0.0593185 0.0001931 -0.0376807 0.2880564 0.1221685 -0.0248166 0.0548809 -0.1122495 0.4509652 -0.1147266 0.261373 -0.1481851 0.3235379 0.6283653 -0.1596193 -0.0873827 -0.2351536 0.1666784 0.0906087 -0.0862922 0.0587 0.2999517 0.7211262 -0.5188535 0.101535 -0.2620976 1.1769924 -0.1698173 -0.0858399 -0.221952 0.5891953 0.3686732 -0.0482852 -0.0036073 -0.0978248 0.5492516 0.0255724 -0.0341519 0.0550502 0.2564239 0.2855394 0.2290232 -0.0714791 0.0659568 0.67797 -0.0260735 -0.0365997 0.100341 0.2616779 0.1080569 0.0312114 -0.0134379 0.0461098 -0.0323079 0.0665187 0.0072171 0.0035389 0.0089032 0.0037518 -0.0232747 -0.0133999 -0.0413814 -0.031958 -0.0799173 -0.05033 -0.0637859 -0.1638123 0.0346818 0.0170063 0.0526609 0.0363812 -0.0362303 -0.0821638 -0.0067275 -0.0235848 -0.1742317 0.0284687 0.0071029 -0.0060601 0.0173284 0.0730076 -0.0302235 0.0093702 -0.0295089 -0.0630692 -0.0237927 0.0555703 -0.0558055 0.0062394 -0.050311 -0.0406725 0.0288126 -0.0326821 -0.1948719 -0.0369266 -0.0466644 -0.0679234 -0.0346103 0.0215535 -0.0473725 -0.1062042 -0.0773633 0.0086554 0.0618336 0.011568 0.0021411 0.0023018 -0.0454409 0.0690911 0.0587122 0.1092184 -0.1013836 0.3295199 0.0410154 0.0132815 0.0230059 0.1476718 0.1426483 0.0033752 0.1075839 0.2822605 0.1643743 0.1055377 0.0481841 0.1543971 0.271434 -0.0907017 0.0514667 -0.088071 0.3370851 0.4192493 -0.0924976 -0.1197628 -0.0899103 0.3106457 0.0070581 -0.1065941 0.0124125 0.2163192 0.0795756 0.0443968 -0.0611832 0.0185569 -0.0478612 0.0949289 -0.0500723 0.1208362 0.0174283 -0.1279311 -0.0665656 0.0562533 0.0421135 0.0311427 -0.0195396 0.0343797 -0.0410717 0.0886399 0.06021 -0.0552223 0.0504154 -0.0281855 -0.0150007 -0.0313466 0.0195775 -0.1637467 -0.1429589 unknown
polarizability: 97.413085|-4.5082015|103.9379036|-0.8985639|-4.3399883|75.9809313 unknown
InChI: InChI=1S/C7H13FO5/c1-12-7-4(8)6(11)5(10)3(2-9)13-7/h3-7,9-11H,2H2,1H3
charge 0 multiplicity 1
26 atoms
F  -2.698865 0.699061 0.569808
O  0.944342 0.698384 -0.285298
O  0.484326 -2.051383 -1.029208
O  -2.040716 -2.149001 0.433921
O  -0.667254 2.329767 -0.827839
O  3.025005 -2.251774 0.210905
C  0.333245 -1.579505 0.357022
C  -1.086649 -1.083018 0.70422
C  1.335463 -0.429278 0.606655
C  -1.454089 0.207809 -0.04647
C  -0.374969 1.29077 0.090019
C  2.783949 -0.81088 0.188423
C  0.167855 3.533845 -0.658343
H  0.566587 -2.458533 0.977116
H  -1.083421 -0.831419 1.79146
H  1.28264 -0.103397 1.667557
H  -1.68422 0.022911 -1.110595
H  -0.304643 1.658674 1.142832
H  3.51694 -0.382169 0.888937
H  2.963511 -0.382205 -0.818553
H  0.462248 -1.254944 -1.624312
H  -2.947427 -1.823123 0.669337
H  2.424208 -2.656475 -0.474714
H  -0.213913 4.260056 -1.390339
H  1.227929 3.304149 -0.863085
H  0.059522 3.942377 0.366545
