program: Gaussian 09
title: 000196322
version: EM64L-G09RevD.01
frameworkgroup: C1[X(C16H26O15)]
method: RPBEPBE
basis: SDD
operation: Freq
keyword: #p
keyword: freq=noraman
keyword: PBEPBE/SDD
title: #p freq=noraman PBEPBE/SDD
converged: NO YES NO NO
title: Mulliken charges:
elementType: O O O O O O O O O O O O O O O C C C C C C C C C C C C C C C C H H H H H H H H H H H H H H H H H H H H H H H H H H
charge: -0.255784 -0.328526 -0.307606 -0.428804 -0.465994 -0.469362 -0.420706 -0.466450 -0.467069 -0.401450 -0.192864 -0.442067 -0.449981 -0.475292 -0.194008 0.034674 0.273488 -0.180727 -0.110757 -0.482549 -0.561240 0.005677 -0.149094 -0.112441 0.159760 -0.122106 -0.163605 0.086326 0.153223 -0.394567 -0.399443 0.252388 0.294039 0.270246 0.235295 0.246006 0.298978 0.263481 0.263695 0.251336 0.220793 0.225084 0.214974 0.348929 0.231080 0.232053 0.223597 0.260957 0.356861 0.372983 0.385724 0.368407 0.365966 0.395539 0.402901 0.349452 0.398583
chargesum: 0.00000
title: Mulliken charges with hydrogens summed into heavy atoms:
elementType: O O O O O O O O O O O O O O O C C C C C C C C C C C C C C C C
charge: -0.255784 -0.328526 -0.307606 -0.079875 -0.109133 -0.096380 -0.034982 -0.098043 -0.101104 -0.005911 -0.192864 -0.039167 -0.100529 -0.076709 -0.194008 0.287062 0.273488 0.113312 0.159489 -0.001248 0.001219 0.269372 0.102242 0.108352 0.159760 0.102978 0.051369 0.086326 0.153223 0.068566 0.085111
polarizability: 2.43118475e+02 -1.87212200e+00 2.23233113e+02 7.46898181e+00 1.98093095e+00 1.95750497e+02
1716.lowfreq: -9.1674 -1.2915 -0.0006 0.0001 0.0004 5.8865 14.2047 27.9092 31.6532
frequency: 12.4058 27.8773 31.6384 42.5436 45.5866 49.9414 59.7199 71.2171 73.6444 82.0936 85.6631 89.1536 98.2451 108.1744 113.8139 129.6146 155.4521 174.7043 182.5317 194.8071 210.0749 222.9266 236.0526 247.1091 248.0735 256.8882 266.2954 277.4413 279.9696 291.2707 301.3301 313.5833 321.1516 326.0061 350.4990 357.5598 372.8550 384.5521 386.6308 406.2923 432.5722 439.2751 456.3070 460.4164 468.4097 485.6959 490.4708 500.4388 527.1328 531.9331 547.7398 568.3472 570.6502 589.9639 598.1048 614.8503 615.8325 632.5586 658.8539 697.2255 705.3447 718.6818 726.9474 740.0357 748.3598 760.6011 805.7545 810.5335 825.7916 830.7914 852.8829 866.1970 873.7342 891.1164 897.8272 921.6156 934.3735 938.4228 942.3903 964.8883 967.3284 978.2638 998.9606 1012.2335 1017.2793 1024.3167 1026.7634 1050.7390 1053.6409 1054.6888 1063.6206 1068.4958 1082.4902 1095.5239 1101.8908 1107.2486 1111.5739 1130.7003 1136.9782 1167.1115 1173.9322 1181.0843 1194.5236 1195.7363 1212.1656 1222.7530 1238.6338 1246.5763 1263.6055 1281.1405 1283.5552 1284.5560 1290.4667 1298.5097 1307.3222 1309.1386 1316.6297 1321.0119 1328.6292 1333.8342 1334.4922 1335.6967 1356.9405 1359.8818 1363.4435 1367.7037 1375.3361 1379.6303 1380.3377 1382.8755 1394.5612 1399.3894 1417.2081 1441.5552 1452.0571 1466.0104 1476.1915 1653.3796 1684.9294 2957.3722 2960.1782 2995.5418 3003.2284 3014.6000 3018.1190 3019.0235 3026.2889 3028.4865 3029.4806 3041.4338 3084.9154 3091.2220 3094.3657 3098.3447 3109.4404 3359.2871 3471.5512 3489.3283 3501.7884 3511.3727 3512.1257 3532.9283 3541.0536 3565.0887 3587.0012
redmass: 7.0756 7.0090 7.0970 9.2900 5.9010 9.7445 6.2734 5.6934 5.5929 4.9408 6.8906 6.1285 7.0470 6.2653 6.9141 3.9254 6.9797 4.0415 5.6409 4.9503 5.4617 3.9719 4.9890 6.0799 4.5429 4.9468 3.5372 2.2381 1.9434 6.5454 5.3319 1.1317 4.9199 5.2583 6.1387 4.0600 3.1170 4.2965 5.8120 5.3439 2.0318 2.1776 2.8285 3.5746 2.5688 1.4135 1.2150 2.5398 1.1569 1.2792 3.0005 1.9658 2.9745 2.0242 2.1061 2.7661 3.8402 2.8604 2.9639 4.1128 2.4742 1.8588 3.4893 4.2698 4.8396 6.3316 5.1794 4.2874 4.7739 4.7244 3.1637 2.9421 3.5287 3.6940 3.3610 3.9123 4.2475 3.4826 4.1196 3.8116 3.9559 5.2076 4.3206 3.6934 2.2197 2.2664 2.1695 2.0909 2.8634 2.8595 2.5470 2.3329 2.7962 2.0091 1.8025 2.2295 2.0257 3.2734 3.7956 1.8019 1.2512 1.1620 1.2706 1.3611 1.5122 1.5006 1.1636 1.2292 1.2621 1.2866 1.3057 1.3996 1.3758 1.3928 1.6054 1.8847 1.4284 1.4073 1.2789 1.3163 1.3277 1.2978 1.4504 1.3739 1.3832 1.2337 1.2837 1.2595 1.3279 1.5457 1.2450 1.6722 1.8113 1.0947 1.0823 1.0770 1.0796 10.0695 10.4431 1.0833 1.0836 1.0843 1.0827 1.0610 1.0591 1.0839 1.0607 1.0843 1.0732 1.0699 1.1032 1.0875 1.1042 1.1067 1.1092 1.0643 1.0655 1.0649 1.0652 1.0643 1.0648 1.0647 1.0648 1.0664 1.0666
irintensity: 0.4368 3.5414 2.4733 0.4969 3.0266 2.5539 0.7532 0.5809 1.7369 0.8147 2.7712 1.9073 1.0162 3.7325 1.8748 5.5298 3.8813 8.6019 0.4840 2.5748 7.3817 10.7735 4.9049 2.2062 2.6017 10.4373 6.4321 80.6688 55.8173 2.6068 5.6138 101.5375 10.9608 12.9878 28.4129 2.3396 13.9610 14.4379 22.2703 0.8542 49.5421 43.9475 20.7661 16.0773 32.0686 28.6043 285.3207 13.5256 137.0604 91.9104 54.6681 61.9406 11.9662 23.2392 129.7519 71.4021 36.5435 46.5229 34.1102 107.6768 68.0249 99.1819 119.3386 56.6428 62.6891 16.5550 37.6487 12.7383 54.9041 11.2093 46.8266 48.0353 46.1697 19.7387 36.2515 48.7819 223.3828 40.2293 8.9430 56.6388 92.6175 138.9568 121.0892 210.1561 30.4191 2.4423 90.8898 66.7871 194.1319 33.2885 112.0861 47.6188 55.6390 37.3601 52.5612 10.6308 12.2148 47.1219 41.1629 48.6728 35.0079 42.9223 24.0427 57.8589 82.1300 2.2853 7.7686 8.6516 31.0164 37.2570 3.0780 7.7127 21.5197 32.9409 21.8579 18.4195 4.1999 13.2906 5.6477 12.3004 10.0343 12.1359 25.8091 14.1333 10.6480 12.8168 24.4804 4.9322 12.7905 65.3253 73.8509 9.2820 7.4152 11.0495 6.3277 12.7057 10.6208 186.7808 164.5516 29.6735 31.4714 6.0515 8.8589 7.2287 25.4900 27.6229 15.7809 14.7202 21.2789 57.4836 4.2598 4.6741 7.1982 21.0832 23.1633 54.8799 105.0544 35.6758 7.5871 40.2860 28.2492 31.9931 62.0795 11.4901 12.3015
temp: 298.150 k
press: 1.00000 atm
elementType: 8 8 8 8 8 8 8 8 8 8 8 8 8 8 8 6 6 6 6 6 6 6 6 6 6 6 6 6 6 6 6 1 1 1 1 1 1 1 1 1 1 1 1 1 1 1 1 1 1 1 1 1 1 1 1 1 1
symmnumber: 1
zpe: 1152765.2 jmol-1
zpe.correction: 0.439065 hartree
zpe.thermalcorrener: 0.471834 hartree
zpe.thermalcorrenthalpy: 0.472778 hartree
zpe.thermalcorrgfe: 0.373925 hartree
zpe.sumelectzpe: -1751.135393 hartree
zpe.sumelectthermal: -1751.102624 hartree
zpe.sumelectthermalent: -1751.101680 hartree
zpe.sumelectthermalfe: -1751.200533 hartree
dipole: 2.7671 -1.4112 -2.9614
dipole: 4.2917
quadrupole: -165.2101 -165.1462 -195.1495
quadrupole: 23.2391 7.0214 -2.2352
quadrupole: 9.9585 10.0224 -19.9809 23.2391 7.0214 -2.2352
hfenergy: -1751.5744579 hartree
pointgroup: C01 [X(C16H26O15)]
dipole: -1.0611781 0.6547567 -1.1384737 debye
polarizability: 243.8690608|0.1110952|223.2178721|-5.0330366|1.4777668|195.015153 unknown
InChI: InChI=1S/C16H26O15/c17-3-6(20)11-9(22)5(19)1-16(31-11,14(26)27)29-8-2-15(28,13(24)25)30-12(10(8)23)7(21)4-18/h5-12,17-24,26,28H,1-4H2
charge 0 multiplicity 1
57 atoms
O  0.569803 1.147978 -0.493523
O  2.242671 0.04043 0.83562
O  -3.140525 -0.914667 -0.663474
O  -2.033568 1.444153 -1.782566
O  4.51222 2.386197 -1.827528
O  5.115081 0.471473 0.000955
O  -1.873372 -2.214121 0.924986
O  -4.390874 2.158837 0.948314
O  2.272561 -2.921173 0.374177
O  0.489047 3.083536 1.654315
O  1.244715 1.311228 2.952145
O  -2.855157 -3.965551 -0.794019
O  -6.851901 0.992474 0.375971
O  2.945151 -1.818368 2.732118
O  -1.87391 -2.935445 -2.638145
C  -0.604019 0.358187 -0.0374
C  1.642008 1.310575 0.480992
C  -1.884043 1.164623 -0.351014
C  -3.084546 0.335105 0.15624
C  2.668924 2.266984 -0.161349
C  -0.623084 -1.012517 -0.746272
C  2.938927 -0.656616 -0.277844
C  3.37221 1.579723 -1.349861
C  4.007649 0.235857 -0.926659
C  -1.931909 -1.76467 -0.439263
C  -4.429484 1.046584 -0.011706
C  3.416069 -1.999107 0.311681
C  1.122766 1.856852 1.838277
C  -2.187343 -2.919193 -1.436074
C  -5.638015 0.145754 0.298481
C  4.030522 -1.879069 1.734192
H  -0.544599 0.197906 1.057906
H  -1.858703 2.149917 0.140184
H  -2.951436 0.067477 1.22195
H  3.430884 2.523565 0.596526
H  2.145504 3.184881 -0.478907
H  0.219477 -1.64146 -0.409932
H  -0.538873 -0.867101 -1.837277
H  2.193974 -0.888603 -1.064934
H  2.645739 1.403545 -2.166687
H  4.378922 -0.277452 -1.840248
H  -4.51336 1.445078 -1.046661
H  4.152608 -2.440402 -0.384558
H  -2.330971 0.601703 -2.219807
H  -5.743954 -0.659689 -0.450526
H  -5.544672 -0.29374 1.305539
H  4.584417 -2.800406 1.974941
H  4.699398 -1.004185 1.792402
H  4.201412 3.283728 -2.10341
H  5.650504 1.211654 -0.392076
H  -2.556006 -2.923205 1.060387
H  -5.338985 2.42622 1.094239
H  1.965215 -2.868144 1.328161
H  0.155846 3.425564 2.528479
H  -3.04224 -4.707566 -1.428317
H  -7.160947 1.206075 -0.540839
H  2.505172 -0.927615 2.643297
