program: Gaussian 09
title: 000187879
version: EM64L-G09RevD.01
frameworkgroup: C1[X(C14H27ClO3S)]
method: RPBEPBE
basis: SDD
operation: Freq
keyword: #p
keyword: freq=noraman
keyword: PBEPBE/SDD
title: #p freq=noraman PBEPBE/SDD
converged: YES YES NO NO
title: Mulliken charges:
elementType: Cl S O O O C C C C C C C C C C C C C C H H H H H H H H H H H H H H H H H H H H H H H H H H H
charge: 0.000262 1.059019 -0.338378 -0.480364 -0.504992 -0.051087 -0.431204 -0.433885 -0.359070 -0.603179 -0.384195 -0.389902 -0.384823 -0.386320 -0.380991 -0.373611 -0.352723 -0.356968 -0.696554 0.292963 0.205236 0.244596 0.304024 0.191072 0.238324 0.312613 0.331031 0.203796 0.188187 0.194682 0.202401 0.192710 0.195329 0.195380 0.193768 0.191623 0.191925 0.190198 0.189757 0.187308 0.187548 0.195356 0.194681 0.209849 0.209280 0.215329
chargesum: 0.00000
title: Mulliken charges with hydrogens summed into heavy atoms:
elementType: Cl S O O O C C C C C C C C C C C C C C
charge: 0.000262 1.059019 -0.338378 -0.480364 -0.504992 0.241876 0.018628 -0.129861 0.070327 0.040465 0.007788 0.007181 0.003216 0.002827 0.002558 0.006345 0.022133 0.033069 -0.062097
polarizability: 2.53940026e+02 3.81284208e+00 1.79462284e+02 8.21043302e+00 1.17885233e+00 1.60479046e+02
1716.lowfreq: -18.3668 -4.4305 -0.0018 -0.0016 0.0005 4.4445 8.5994 19.6109 26.6748
frequency: -11.1540 18.6407 26.6169 28.9923 49.9130 52.5319 60.5750 65.4795 92.8826 95.1527 112.1434 122.3462 125.5809 129.4161 140.5504 149.9305 164.8073 193.5659 223.9510 236.3944 245.5534 267.3853 272.6498 281.3875 311.0093 354.5153 390.5260 405.2989 453.0406 469.7138 487.7695 491.5173 511.7954 533.0458 642.2999 719.3058 722.3772 729.5959 739.4819 748.9587 770.2812 799.3539 830.8306 851.0785 868.9713 874.3725 888.2920 914.8389 933.7129 977.2042 978.0157 985.8292 991.8454 1015.1907 1017.0544 1029.2588 1041.3942 1050.7311 1065.5441 1077.0161 1080.7001 1081.1909 1086.1070 1114.1333 1123.4735 1134.3672 1167.6071 1182.8051 1200.1662 1205.7041 1210.0152 1228.6916 1234.2316 1239.9485 1259.4527 1263.2515 1277.3651 1277.4962 1281.2929 1285.6208 1289.5135 1293.1104 1294.7975 1299.4425 1311.2946 1325.9358 1342.6127 1352.8470 1353.8023 1357.6133 1359.6989 1389.6298 1402.3522 1448.5296 1458.5363 1458.8186 1462.3242 1462.7089 1466.1502 1471.2490 1476.8314 1478.0142 1482.0334 1486.2121 1488.9285 2948.0148 2948.5076 2949.6993 2951.1270 2953.2600 2958.1914 2963.0419 2964.3404 2967.2405 2971.3155 2971.8116 2981.3918 2985.5800 2991.4408 2998.2002 3008.8429 3016.2301 3021.4438 3031.8947 3037.4322 3041.2412 3055.5424 3065.9647 3067.9867 3070.0156 3086.8497 3171.7649
redmass: 2.9360 4.0013 4.5926 2.5187 5.9778 2.0204 3.6160 3.3644 2.1674 2.4808 4.1336 2.5865 5.8021 2.3304 2.4130 1.9964 4.6178 3.8503 5.7082 1.1019 5.3290 5.1639 8.1077 4.7350 4.4010 3.2812 3.2553 4.1164 6.7541 3.8540 3.9430 4.6101 7.0103 3.3911 3.5789 1.0594 1.0700 1.0934 1.5674 1.9510 1.4098 1.6654 1.7460 7.5138 1.8309 1.5000 1.9063 1.9660 1.6908 1.4958 4.0176 5.4125 3.1099 3.4381 1.6826 1.5967 2.4556 2.3279 2.6762 2.3539 2.2220 2.2479 2.5549 1.3162 2.8342 1.5458 1.2920 1.8473 1.2705 1.4828 1.3196 1.3127 1.3973 1.3217 1.2998 1.3138 1.2599 1.0324 1.2827 1.0464 1.2061 1.1014 1.1647 1.2069 1.2310 1.3211 1.4235 1.6134 1.6204 1.6091 1.5734 1.2172 1.1010 1.0828 1.0736 1.0738 1.0734 1.0621 1.0798 1.0847 1.0852 1.0425 1.0884 1.0931 1.0913 1.0586 1.0585 1.0591 1.0591 1.0595 1.0594 1.0591 1.0592 1.0587 1.0364 1.0651 1.0960 1.0968 1.0979 1.0999 1.1023 1.0967 1.1040 1.1032 1.0914 1.1034 1.1023 1.0577 1.1006 1.0993 1.0864 1.1114
irintensity: 0.1279 0.9070 0.3746 0.4658 2.6171 0.3085 0.6573 0.5494 0.0803 0.2437 0.3768 0.9079 0.2160 0.3219 0.2401 0.0066 0.2899 3.0327 2.8675 0.0053 2.6323 4.1766 5.8738 4.1519 2.9533 6.9424 1.1081 4.7887 35.0188 38.7560 20.8571 24.7243 11.2845 10.8018 20.5376 16.8841 0.1088 6.2850 5.7669 7.6652 2.1068 10.5838 19.5985 90.0341 2.4663 0.5129 4.7419 4.8973 5.3669 7.7085 36.0780 74.4207 3.4611 9.8792 6.1918 1.1681 7.0805 1.2410 2.6654 0.2560 0.1749 1.2381 2.0062 10.7384 12.3973 1.7896 0.2446 0.4105 15.1071 4.9837 14.7182 3.0680 1.3560 4.2468 1.5794 12.1959 4.7455 0.6680 8.4932 1.5971 4.0318 1.2266 0.1805 3.3491 9.2774 3.9160 1.9473 0.3370 0.1488 0.5360 0.6490 11.2121 26.1198 4.4507 0.0126 0.0902 0.1014 0.1082 0.7928 0.5337 2.4105 12.2898 1.9756 7.8860 34.0097 0.0099 0.2988 0.1043 5.5712 2.2258 1.9069 74.2528 4.4870 166.2523 37.4422 78.3827 1.2874 1.8313 2.6528 2.3142 1.0540 8.5466 1.7250 0.6273 16.5496 175.7512 97.5079 2.4460 95.0356 56.6275 5.0758 1.9362
temp: 298.150 k
press: 1.00000 atm
elementType: 17 16 8 8 8 6 6 6 6 6 6 6 6 6 6 6 6 6 6 1 1 1 1 1 1 1 1 1 1 1 1 1 1 1 1 1 1 1 1 1 1 1 1 1 1 1
symmnumber: 1
zpe: 1022523.0 jmol-1
zpe.correction: 0.389458 hartree
zpe.thermalcorrener: 0.412793 hartree
zpe.thermalcorrenthalpy: 0.413738 hartree
zpe.thermalcorrgfe: 0.332906 hartree
zpe.sumelectzpe: -1631.748215 hartree
zpe.sumelectthermal: -1631.724880 hartree
zpe.sumelectthermalent: -1631.723936 hartree
zpe.sumelectthermalfe: -1631.804767 hartree
dipole: 1.6320 -4.4949 4.0177
dipole: 6.2457
quadrupole: -146.9230 -142.8714 -133.2308
quadrupole: 15.2651 -23.0166 0.7751
quadrupole: -5.9147 -1.8630 7.7776 15.2651 -23.0166 0.7751
hfenergy: -1632.1376736 hartree
pointgroup: C01 [X(C14H27Cl1O3S1)]
dipole: -0.6497866 -1.8436126 -1.4889534 debye
polarizability: 253.8065586|-3.947412|179.3442098|8.7964837|-2.2464144|160.7305869 unknown
InChI: InChI=1S/C14H27ClO3S/c1-2-3-4-5-6-7-8-9-10-11-14-13(15)12-19(16,17)18-14/h13-14H,2-12H2,1H3
charge 0 multiplicity 1
46 atoms
Cl 6.63311 -1.817516 0.492081
S  5.022544 1.579551 -0.015235
O  4.156162 0.306886 1.117006
O  6.199575 2.278274 0.830179
O  3.930908 2.483923 -0.797033
C  3.95553 -0.914549 0.319055
C  2.654844 -0.868735 -0.513216
C  5.218722 -1.145956 -0.567901
C  1.400254 -0.721276 0.376744
C  5.646738 0.151051 -1.230714
C  0.097736 -0.649938 -0.449831
C  -1.165192 -0.477578 0.423696
C  -2.470085 -0.420021 -0.401891
C  -3.733091 -0.196827 0.459858
C  -5.036082 -0.147677 -0.369581
C  -6.298355 0.114224 0.482516
C  -7.599382 0.16233 -0.350198
C  -8.861378 0.440922 0.497791
C  -10.155097 0.490313 -0.343804
H  3.902896 -1.718369 1.076896
H  2.576946 -1.805724 -1.103267
H  2.689607 -0.024523 -1.230787
H  5.020884 -1.935685 -1.309092
H  1.344984 -1.577861 1.080661
H  1.503656 0.191761 0.993206
H  5.108821 0.368486 -2.16574
H  6.731307 0.299878 -1.310269
H  0.163749 0.197884 -1.162944
H  -0.004829 -1.569573 -1.064358
H  -1.227906 -1.313024 1.152067
H  -1.069283 0.451538 1.022803
H  -2.581497 -1.36218 -0.978931
H  -2.392168 0.395684 -1.151046
H  -3.624688 0.751114 1.027355
H  -3.810425 -1.004921 1.21727
H  -5.157092 -1.104671 -0.91952
H  -4.946926 0.644607 -1.142401
H  -6.177953 1.073415 1.028597
H  -6.388858 -0.674912 1.258371
H  -7.726965 -0.800123 -0.889083
H  -7.505342 0.945007 -1.132215
H  -8.732678 1.402014 1.036539
H  -8.956068 -0.341653 1.278383
H  -10.099396 1.287884 -1.108706
H  -10.321461 -0.468036 -0.871399
H  -11.042174 0.687683 0.285983
