program: Gaussian 09
title: 000187877
version: EM64L-G09RevD.01
frameworkgroup: C1[X(C7H6N2O2)]
method: RPBEPBE
basis: SDD
operation: Freq
keyword: #pfreq=noraman
keyword: PBEPBE/SDD
title: #p freq=noraman PBEPBE/SDD
converged: NO YES NO NO
title: Mulliken charges:
elementType: O O N N C C C C C C C H H H H H H
charge: -0.437508 -0.243520 -0.074415 -0.298054 0.260436 -0.335633 -0.306045 0.136096 -0.310951 -0.260585 0.119148 0.277545 0.278335 0.261654 0.281536 0.388295 0.263668
chargesum: 0.00000
title: Mulliken charges with hydrogens summed into heavy atoms:
elementType: O O N N C C C C C C C
charge: -0.049214 -0.243520 -0.074415 -0.034387 0.260436 -0.058088 -0.027710 0.136096 -0.049297 0.020951 0.119148
polarizability: 1.73728653e+02 7.88342460e+00 9.65594877e+01 -7.30307457e-03 -1.08081315e-02 3.73142949e+01
1716.lowfreq: -8.7201 -4.5020 -0.0010 -0.0007 -0.0004 4.2469 61.8342 73.5898 123.3155
frequency: 61.8190 73.5889 123.2994 162.1576 264.0965 283.1472 323.7423 406.7995 469.2105 481.2865 512.1677 595.6176 611.5785 628.8895 681.6333 698.7887 749.4508 804.1250 859.3051 868.0237 941.0571 1000.8350 1004.0420 1013.4901 1021.7500 1108.1796 1130.1623 1149.4686 1192.0340 1288.2403 1322.2057 1346.5612 1401.6108 1419.2922 1456.0138 1481.7031 1579.5785 1614.4991 1641.1270 3155.9327 3160.7906 3173.9370 3174.9737 3181.5442 3530.0225
redmass: 10.0046 5.6642 8.4080 6.7494 5.4816 5.0986 8.1552 2.8840 2.6862 6.8546 6.0855 1.2483 5.2954 6.7345 3.2901 4.6734 2.8382 5.9031 1.4696 1.2417 1.5071 3.8035 1.3918 1.3691 3.0147 1.3068 2.1534 1.7643 1.5320 1.3365 2.8316 2.3710 8.6398 3.4410 2.1572 2.5411 7.4967 6.3163 8.7654 1.0885 1.0884 1.0793 1.0929 1.0970 1.0642
irintensity: 1.4070 0.1724 1.0847 1.3650 0.4356 0.2783 4.8225 0.0031 55.0581 11.2634 34.2429 70.0220 12.5299 1.0394 98.2396 43.6678 12.0308 7.5891 6.3855 0.0032 93.9171 102.8625 0.8761 0.8782 177.1343 3.1447 30.3856 138.1093 8.6555 6.2794 117.7954 57.4686 1.8013 30.6427 22.9374 4.4520 14.2979 6.8472 287.4459 0.3534 0.3393 7.7106 8.5167 0.3847 52.6898
temp: 298.150 k
press: 1.00000 atm
elementType: 8 8 7 7 6 6 6 6 6 6 6 1 1 1 1 1 1
symmnumber: 1
zpe: 317894.3 jmol-1
zpe.correction: 0.121080 hartree
zpe.thermalcorrener: 0.130454 hartree
zpe.thermalcorrenthalpy: 0.131398 hartree
zpe.thermalcorrgfe: 0.085717 hartree
zpe.sumelectzpe: -529.471444 hartree
zpe.sumelectthermal: -529.462069 hartree
zpe.sumelectthermalent: -529.461125 hartree
zpe.sumelectthermalfe: -529.506807 hartree
dipole: -0.4611 -1.1055 0.0004
dipole: 1.1978
quadrupole: -56.2118 -61.8504 -64.7330
quadrupole: -7.5382 -0.0031 0.0358
quadrupole: 4.7199 -0.9187 -3.8012 -7.5382 -0.0031 0.0358
hfenergy: -529.5925235 hartree
pointgroup: C01 [X(C7H6N2O2)]
dipole: 0.1778933 -0.4353469 0.0301176 debye
dipolederiv: -0.6988463 -0.4267271 0.0181036 -0.6108306 -1.010119 0.0192148 0.0294637 0.0244232 -0.4271967 -1.0477077 0.2869722 -0.0347097 0.1952903 -0.7810825 0.0315273 -0.0286191 0.0331637 -0.3324703 0.8626635 -0.0860631 0.0287854 -0.1082472 -0.1329849 -0.0003127 0.0340577 0.0003031 -0.0862764 -0.4258105 0.1455688 -0.0124808 0.6038894 -0.1541742 0.0099902 -0.0407453 -0.0023164 -0.2607004 -0.6723717 -0.0349708 -0.0151199 -0.1196065 0.0457305 -0.0045853 -0.0106959 -0.0025704 0.020226 0.0695159 -0.2229805 0.0182063 0.0215779 -0.0209885 -0.0054009 0.0046238 -0.0118863 -0.1174435 -0.0159971 0.2240753 -0.0107281 0.0169369 0.0100914 -0.0073799 0.001634 -0.0018645 -0.1149483 -0.3960666 0.0035335 -0.010181 -0.2530811 0.1449269 -0.0143599 0.0018105 -0.0072819 0.016274 -0.0403062 0.2415492 -0.0121673 0.0246758 0.0380434 -0.0085712 -0.0013675 -0.0032464 -0.1180871 -0.1036916 -0.224 0.0131253 -0.0099101 -0.0795886 -0.0013119 0.00167 -0.0065492 -0.0947773 2.0472631 0.0789757 0.0398736 0.2884797 1.4029851 -0.061314 0.0266806 -0.066635 0.243073 0.0806492 0.0731382 -0.0065 0.0472091 0.0326608 0.0088676 -0.0049653 0.0095633 0.1586379 0.0844641 -0.0541589 0.0013634 -0.0548706 0.0158777 0.007171 0.0015088 0.0073926 0.1564263 0.0657995 -0.0730404 0.0018434 -0.055996 -0.0044794 0.0085486 0.00073 0.0082402 0.1621262 0.0935082 0.0646513 -0.0057696 0.0346068 0.0326535 0.0086059 -0.0041734 0.0090844 0.159859 0.1837485 0.075732 -0.0096197 0.1640678 0.3074012 0.0097081 -0.0147534 0.0075502 0.4036403 -0.0868144 -0.0722555 -0.0040251 -0.1841916 0.1530464 -0.0003976 0.0031407 0.0026294 0.2316371 unknown
polarizability: 173.5130104|-8.2776672|96.4581576|3.9043407|-3.7049061|37.6312674 unknown
InChI: InChI=1S/C7H6N2O2/c8-9-6-3-1-5(2-4-6)7(10)11/h1-4,8,10H
charge 0 multiplicity 1
17 atoms
O  -3.090629 -1.289895 0.015496
O  -3.325712 1.015719 -0.125616
N  3.159559 0.387838 0.07634
N  3.847989 -0.712387 0.153294
C  -1.086613 0.041456 -0.014955
C  -0.445289 1.305296 -0.074085
C  -0.315842 -1.15112 0.076222
C  1.724686 0.186396 0.049339
C  0.959337 1.375925 -0.041234
C  1.085656 -1.082764 0.108939
C  -2.574815 0.013352 -0.049428
H  -1.06077 2.207444 -0.144384
H  -0.833116 -2.113327 0.121407
H  1.489018 2.332779 -0.084414
H  1.704676 -1.982517 0.178635
H  -4.084003 -1.244009 -0.010477
H  4.862469 -0.436085 0.16272
