program: Gaussian 09
title: 000187872
version: EM64L-G09RevD.01
frameworkgroup: C1[X(C2H6N)]
method: RPBEPBE
basis: SDD
operation: Freq
keyword: #p
keyword: freq=noraman
keyword: PBEPBE/SDD
title: #p freq=noraman PBEPBE/SDD
converged: NO YES NO NO
title: Mulliken charges:
elementType: N C C H H H H H H
charge: -0.585654 -0.424975 -0.689443 0.048292 0.119689 0.107138 0.186829 0.167831 0.070292
chargesum: -1.00000
title: Mulliken charges with hydrogens summed into heavy atoms:
elementType: N C C
charge: -0.515362 -0.256994 -0.227645
polarizability: 4.77610058e+01 -3.12997389e+00 3.52917791e+01 -1.47347062e+00 -8.54783992e-01 3.20322563e+01
1716.lowfreq: -15.6727 0.0004 0.0009 0.0009 14.9448 24.0203 295.3015 367.4348 440.4062
frequency: 295.2992 367.4167 440.3766 752.3877 777.2780 960.6426 1008.0430 1066.9609 1218.1935 1287.7170 1311.2876 1326.3708 1421.6076 1430.4657 1459.5769 2434.2607 2807.8542 2836.8050 2965.9834 3018.7203 3101.6223
redmass: 1.1111 1.8501 1.3285 2.0236 1.1891 3.5767 1.2874 2.1962 1.2517 1.1806 1.2932 1.1923 1.0574 1.0817 1.0679 1.0672 1.0519 1.0731 1.0781 1.0997 1.0718
irintensity: 1.6880 5.7148 113.2219 29.0826 4.8281 84.5242 68.1466 24.3173 13.9995 18.2472 17.1331 31.3010 9.4494 14.1018 1.6621 582.8643 263.2419 206.1994 107.7835 95.3371 255.1635
temp: 298.150 k
press: 1.00000 atm
elementType: 7 6 6 1 1 1 1 1 1
symmnumber: 1
zpe: 193130.3 jmol-1
zpe.correction: 0.073559 hartree
zpe.thermalcorrener: 0.077786 hartree
zpe.thermalcorrenthalpy: 0.078730 hartree
zpe.thermalcorrgfe: 0.048323 hartree
zpe.sumelectzpe: -134.222493 hartree
zpe.sumelectthermal: -134.218267 hartree
zpe.sumelectthermalent: -134.217323 hartree
zpe.sumelectthermalfe: -134.247730 hartree
dipole: -4.3912 0.2540 1.0664
dipole: 4.5259
quadrupole: -35.8553 -24.7799 -24.2423
quadrupole: 0.0194 2.0556 -1.7198
quadrupole: -7.5628 3.5126 4.0502 0.0194 2.0556 -1.7198
hfenergy: -134.2960529 hartree
pointgroup: C01 [X(C2H6N1)]
dipole: 1.7390913 -0.119796 0.3631238 debye
dipolederiv: -1.2158809 0.0627302 0.1342534 0.0644938 -0.7806461 0.3255796 0.075645 0.313183 -0.3453622 0.8928875 -0.1834654 -0.0320042 -0.0890364 0.682116 -0.1423966 -0.0066114 -0.174749 0.3942745 -0.269472 -0.2692966 0.0615472 -0.3362628 -0.0391757 0.0255444 -0.0082413 0.0427035 0.0386513 -0.1591295 0.1760054 -0.1199049 0.0629968 -0.4435684 0.3148131 -0.1232622 0.423422 -0.329242 -0.0134229 0.0316743 0.0439019 0.0062642 -0.1849589 -0.2124764 0.0380714 -0.241925 -0.2266934 -0.5088688 0.1666777 0.0358522 0.2805572 -0.0744208 -0.0140003 -0.0025052 -0.0051357 0.0671883 0.0746069 0.0018607 0.0037014 -0.0679069 -0.0796428 0.1708723 0.0795914 0.1551043 -0.1352555 0.0435599 0.0055794 -0.0146949 -0.0271738 -0.0536141 -0.1525088 -0.0594435 -0.1622046 -0.168725 0.1557199 0.0082343 -0.1126523 0.106068 -0.0260892 -0.3154272 0.0067559 -0.3503985 -0.2948361 unknown
polarizability: 47.9056505|-3.0437461|34.9537849|0.7056608|1.2948001|32.2256059 unknown
InChI: InChI=1S/C2H6N/c1-2-3/h3H,2H2,1H3
charge -1 multiplicity 1
9 atoms
N  -1.301081 0.261912 -0.031151
C  -0.089026 -0.539803 0.024609
C  1.284923 0.261888 0.003527
H  0.056676 -1.271837 0.906496
H  -0.073804 -1.201173 -0.881007
H  2.20126 -0.38808 -0.03074
H  1.284381 0.944873 -0.871629
H  1.345414 0.891151 0.918202
H  -1.298642 0.856068 0.843293
