program: Gaussian 09
title: 000187868
version: EM64L-G09RevD.01
frameworkgroup: C1[X(C17H36)]
method: RPBEPBE
basis: SDD
operation: Freq
keyword: #p
keyword: freq=noraman
keyword: PBEPBE/SDD
title: #p freq=noraman PBEPBE/SDD
converged: YES YES NO NO
title: Mulliken charges:
elementType: C C C C C C C C C C C C C C C C C H H H H H H H H H H H H H H H H H H H H H H H H H H H H H H H H H H H H
charge: -0.026824 -0.424765 -0.391688 -0.404411 -0.421010 -0.379388 -0.388319 -0.383592 -0.746962 -0.030744 -0.383478 -0.371512 -0.354315 -0.717208 -0.716581 -0.356136 -0.696945 0.190910 0.187965 0.204045 0.181994 0.197480 0.203176 0.202674 0.215423 0.204031 0.190392 0.191601 0.190588 0.191780 0.192078 0.191347 0.211540 0.211435 0.211728 0.195385 0.191736 0.192285 0.188857 0.189309 0.187533 0.187845 0.211535 0.209720 0.213085 0.210009 0.211792 0.211390 0.194766 0.194448 0.214667 0.209615 0.209714
chargesum: 0.00000
title: Mulliken charges with hydrogens summed into heavy atoms:
elementType: C C C C C C C C C C C C C C C C C
charge: 0.164086 -0.032754 -0.012214 0.001438 -0.001556 0.002604 -0.005951 -0.000166 -0.112259 0.164641 0.000543 0.006654 0.021063 -0.082869 -0.083390 0.033077 -0.062948
polarizability: 2.17158573e+02 -4.31768049e+00 1.81836632e+02 6.03691273e-02 -1.07880906e+00 1.58156986e+02
1716.lowfreq: -6.2513 -0.0007 0.0010 0.0015 6.2421 9.9687 17.7502 24.9761 35.4847
frequency: 13.8423 22.4831 35.4730 41.2850 47.7713 66.7382 74.6635 84.4662 105.4224 108.3591 119.7039 123.5116 135.7905 144.6030 162.8231 182.2271 207.2094 220.8766 222.2732 229.3308 232.0086 246.0309 285.3587 316.7252 349.7130 356.4094 365.5432 406.0961 433.6460 444.5669 475.9352 546.9654 559.6473 717.2653 721.3830 731.2485 737.4574 758.1418 774.8581 803.8120 820.5870 831.5454 876.8736 888.0531 913.2150 928.8957 941.6161 949.5776 958.1535 969.3948 984.4723 986.0758 996.8670 1002.8273 1027.0114 1035.8595 1041.6667 1050.9587 1065.6747 1069.0984 1080.4034 1081.6103 1108.9575 1115.5729 1140.6144 1156.9607 1172.8051 1185.6079 1191.1055 1192.3504 1212.8085 1221.5765 1240.6366 1247.6851 1254.9886 1268.3569 1279.2762 1281.1003 1284.3958 1289.0912 1291.0573 1293.5404 1297.6888 1302.3912 1315.9724 1324.7606 1332.3811 1337.2250 1346.3686 1350.0936 1355.5211 1356.8408 1359.4827 1365.8119 1375.6292 1388.1927 1388.5767 1393.5274 1456.5850 1457.9529 1458.6399 1462.1789 1462.7424 1463.8910 1466.6545 1467.9341 1472.9059 1476.1153 1476.4545 1477.3426 1478.4251 1482.2817 1484.6417 1485.7423 1487.6721 1489.2757 1490.3478 2939.3089 2941.7556 2947.3733 2948.8991 2950.0890 2953.1589 2954.0003 2959.6594 2961.0167 2961.5042 2966.9187 2968.0520 2968.4142 2969.8831 2971.0851 2971.3443 2974.0761 2981.4050 2985.9980 2992.8549 2994.4886 3000.0195 3002.9648 3009.2772 3022.5588 3034.4361 3039.6606 3043.4775 3062.9074 3063.3730 3064.0293 3065.0626 3067.0230 3068.1308 3069.4781 3070.5364
redmass: 3.6162 1.6504 3.2854 2.6589 3.3485 2.0913 2.0350 2.8934 2.7728 2.1318 2.5201 1.7828 2.2296 2.0267 1.8833 2.7517 1.8227 1.9531 1.2713 1.2124 1.6615 1.0578 2.7839 3.0329 2.3384 2.0527 2.5591 2.5064 2.5757 3.0249 2.8665 2.3872 2.2996 1.0607 1.0748 1.1115 1.1305 1.1721 3.0646 1.3841 2.0271 1.4106 1.2787 1.8949 1.1986 1.7634 1.2997 1.5247 1.6315 2.2006 1.9729 2.2792 2.7367 1.3816 2.3829 1.5958 2.1820 1.5761 2.3565 2.5790 2.2527 2.1346 1.7979 1.9012 2.2112 2.2349 1.9883 1.6769 1.6296 1.9123 1.3169 1.4237 1.3512 1.3388 1.2870 1.2661 1.1696 1.0460 1.3080 1.0916 1.0877 1.1376 1.1744 1.2604 1.4050 1.4527 1.4243 1.4530 1.4670 1.5435 1.6970 1.6176 1.4581 1.4629 1.2172 1.2183 1.2212 1.2181 1.0729 1.0740 1.0733 1.0648 1.0771 1.0779 1.0452 1.0754 1.0725 1.0568 1.0513 1.0589 1.0778 1.0867 1.0753 1.0489 1.0837 1.0705 1.0710 1.0765 1.0655 1.0588 1.0587 1.0592 1.0594 1.0610 1.0589 1.0698 1.0641 1.0591 1.0544 1.0403 1.0419 1.0526 1.0367 1.0441 1.0962 1.0976 1.0976 1.0978 1.1011 1.1001 1.1033 1.1046 1.1047 1.1039 1.1041 1.1000 1.0996 1.0992 1.0991 1.0989 1.1006 1.0992 1.0986
irintensity: 0.0001 0.0020 0.0053 0.0064 0.0158 0.0038 0.0033 0.0108 0.0595 0.0152 0.0008 0.0095 0.0086 0.0013 0.0195 0.0086 0.0256 0.0464 0.0260 0.0077 0.0798 0.0719 0.1189 0.0537 0.0504 0.0085 0.0291 0.1317 0.0440 0.6933 0.1278 3.0237 7.8839 15.9961 0.4793 5.8205 5.2006 0.1155 1.1209 2.5879 0.6734 0.6532 0.0404 5.1914 2.0939 3.6435 0.8469 0.9932 0.4882 1.5198 0.0938 1.0938 0.5555 0.7121 1.7431 0.4224 0.2164 1.5073 0.5029 0.7818 0.0707 0.2175 6.5537 6.4837 1.6409 1.9916 6.4107 3.4881 5.7770 6.8310 11.0962 0.7342 10.8407 1.8055 0.4103 0.2606 0.0865 0.0766 2.5010 1.3388 0.3061 0.0824 0.9017 3.7806 2.2572 0.2814 0.5065 3.6542 0.2855 2.6616 0.0975 1.3563 1.6714 3.5538 23.4144 10.2634 20.8592 12.1943 1.3130 0.1119 0.5855 1.3066 0.4837 2.9658 1.6108 0.9724 5.1601 3.0367 4.8488 8.3468 3.4399 5.4807 6.4820 13.2760 7.9175 47.7016 13.1371 17.2816 12.2287 0.1403 1.6979 0.7196 4.1121 8.8589 36.4440 46.0013 14.6050 14.4528 119.5704 70.3261 36.6098 140.1993 31.6977 48.4626 0.2013 0.3435 12.7414 12.8756 3.7940 10.1064 2.6483 6.5217 7.8697 132.1543 235.1746 23.7362 11.1535 71.2445 52.3899 67.4050 99.0555 53.1597 108.6370
temp: 298.150 k
press: 1.00000 atm
elementType: 6 6 6 6 6 6 6 6 6 6 6 6 6 6 6 6 6 1 1 1 1 1 1 1 1 1 1 1 1 1 1 1 1 1 1 1 1 1 1 1 1 1 1 1 1 1 1 1 1 1 1 1 1
symmnumber: 1
zpe: 1292403.9 jmol-1
zpe.correction: 0.492251 hartree
zpe.thermalcorrener: 0.515807 hartree
zpe.thermalcorrenthalpy: 0.516751 hartree
zpe.thermalcorrgfe: 0.436001 hartree
zpe.sumelectzpe: -667.959339 hartree
zpe.sumelectthermal: -667.935783 hartree
zpe.sumelectthermalent: -667.934839 hartree
zpe.sumelectthermalfe: -668.015589 hartree
dipole: -0.1553 -0.0515 -0.0661
dipole: 0.1764
quadrupole: -114.1636 -112.7655 -113.9174
quadrupole: 0.9281 -0.0937 0.5821
quadrupole: -0.5481 0.8500 -0.3019 0.9281 -0.0937 0.5821
hfenergy: -668.4515898 hartree
pointgroup: C01 [X(C17H36)]
dipole: 0.0603858 0.022184 -0.0260823 debye
polarizability: 217.4250487|-3.0290846|181.5896954|0.0953704|0.8270885|158.1374468 unknown
InChI: InChI=1S/C17H36/c1-5-6-7-8-9-10-11-14-17(4)15-12-13-16(2)3/h16-17H,5-15H2,1-4H3
charge 0 multiplicity 1
53 atoms
C  2.790617 -2.20846 0.293091
C  1.458611 -1.777842 0.977179
C  3.382134 -1.124481 -0.649476
C  0.308205 -1.388882 0.019148
C  3.706234 0.225489 0.031037
C  -1.011303 -1.072852 0.760073
C  4.386212 1.216748 -0.943295
C  -2.154506 -0.65153 -0.190577
C  2.636798 -3.55335 -0.460068
C  4.741474 2.616329 -0.362751
C  -3.490077 -0.368344 0.533233
C  -4.622557 0.06471 -0.425194
C  -5.967679 0.328924 0.288023
C  5.767076 2.530151 0.793939
C  3.484795 3.410749 0.069975
C  -7.094636 0.767138 -0.675163
C  -8.438545 1.022036 0.041047
H  3.528021 -2.368196 1.110796
H  1.117108 -2.613316 1.624082
H  1.655753 -0.925281 1.658861
H  4.314054 -1.526272 -1.100761
H  2.685633 -0.95093 -1.496018
H  0.123798 -2.208584 -0.704414
H  0.602983 -0.50363 -0.580675
H  2.775057 0.674586 0.427882
H  4.365135 0.039966 0.903644
H  -1.326472 -1.964362 1.342223
H  -0.833179 -0.266042 1.502098
H  5.316242 0.749299 -1.330762
H  3.721322 1.358541 -1.821821
H  -1.845215 0.253251 -0.755117
H  -2.312093 -1.448744 -0.947408
H  1.956175 -3.454419 -1.326382
H  3.612753 -3.905807 -0.84366
H  2.227864 -4.339091 0.202939
H  5.222044 3.183553 -1.189111
H  -3.805966 -1.27712 1.087413
H  -3.333625 0.421778 1.29746
H  -4.767162 -0.719499 -1.198033
H  -4.310619 0.981084 -0.969205
H  -6.284347 -0.588825 0.826847
H  -5.825678 1.110276 1.064087
H  6.663971 1.956445 0.492198
H  6.097251 3.53909 1.104808
H  5.330589 2.035305 1.68136
H  3.7538 4.441374 0.368606
H  2.984932 2.934848 0.934392
H  2.749176 3.475903 -0.754024
H  -6.779013 1.68635 -1.210072
H  -7.231451 -0.012051 -1.453044
H  -9.225993 1.330677 -0.671219
H  -8.790249 0.109803 0.55924
H  -8.338157 1.82031 0.800666
