program: Gaussian 09
title: 000187867
version: EM64L-G09RevD.01
frameworkgroup: C1[X(C12H8Cl2O)]
method: RPBEPBE
basis: SDD
operation: Freq
keyword: #p
keyword: freq=noraman
keyword: PBEPBE/SDD
title: #p freq=noraman PBEPBE/SDD
converged: NO YES NO NO
title: Mulliken charges:
elementType: Cl Cl O C C C C C C C C C C C C H H H H H H H H
charge: -0.042185 -0.046805 -0.429281 0.344516 0.458908 -0.348243 -0.376642 -0.321683 -0.374468 -0.388405 -0.353077 -0.218060 -0.232797 0.286860 -0.097289 0.255845 0.248361 0.259297 0.223163 0.253649 0.282025 0.259771 0.356540
chargesum: 0.00000
title: Mulliken charges with hydrogens summed into heavy atoms:
elementType: Cl Cl O C C C C C C C C C C C C
charge: -0.042185 -0.046805 -0.072741 0.344516 0.458908 -0.092398 -0.128281 -0.321683 -0.115171 -0.165242 -0.099428 0.063965 0.026974 0.286860 -0.097289
polarizability: 2.59470859e+02 -7.94279949e+00 1.39616277e+02 -1.02342754e+00 1.06616351e+01 7.50674284e+01
1716.lowfreq: -9.1349 -4.5104 -0.0034 -0.0018 0.0013 4.6621 43.8318 53.8154 75.5496
frequency: 43.7862 53.8099 75.5487 150.1800 163.2037 176.9706 202.7966 235.8236 297.7750 357.0083 371.7835 372.1234 400.6542 411.9790 446.8609 450.9098 476.2544 539.0743 560.3690 603.5569 633.5184 660.2847 707.6580 733.0821 759.5968 807.0010 811.9297 819.2789 840.1058 866.0746 937.8686 952.3139 960.8833 982.9127 1008.0446 1053.4821 1086.1920 1105.1377 1139.9701 1146.1049 1185.2488 1243.6791 1252.3439 1286.5573 1307.8070 1338.3459 1373.9691 1386.8505 1425.2261 1455.9890 1511.0701 1556.4977 1589.6994 1590.6706 1626.0035 3119.2196 3136.6626 3148.4338 3165.4318 3174.4715 3178.6931 3184.5822 3580.1902
redmass: 7.2545 6.4810 5.4742 7.4881 5.8416 16.2213 7.1499 11.0274 7.0821 5.1564 1.2503 5.7203 4.1922 2.9842 5.7237 5.0238 4.3453 3.1254 3.3980 7.2734 6.8441 7.1511 4.0889 3.8090 7.9429 1.3757 5.8758 1.3638 1.5556 1.4002 1.3417 1.3548 1.3522 7.1633 2.7758 3.2713 2.3717 1.4693 1.3946 1.3373 1.1132 1.4785 2.2375 2.4871 1.5675 2.6983 5.4736 4.8107 3.4693 2.5448 3.0514 8.0518 6.6676 7.1886 6.3954 1.0898 1.0895 1.0891 1.0946 1.0958 1.0960 1.0937 1.0660
irintensity: 0.3457 0.5632 0.8361 0.5376 0.2644 0.8358 0.7539 0.1489 1.4099 3.7042 122.3188 28.6412 10.4774 0.4999 18.2292 16.0133 1.2669 31.3540 5.4521 2.3728 1.6278 4.5827 2.1201 0.7960 83.5497 40.5203 5.3372 47.8183 22.7036 20.8445 0.2659 0.3347 0.4383 24.8151 4.6800 28.4092 29.0272 71.6035 1.9583 248.8795 14.1776 4.6107 27.3330 18.2368 8.0222 18.4767 10.1951 20.9727 18.8262 171.0926 29.9417 22.6424 31.8167 5.1933 85.6611 21.1984 9.0212 3.9085 6.9456 4.1190 1.8289 0.9902 57.2286
temp: 298.150 k
press: 1.00000 atm
elementType: 17 17 8 6 6 6 6 6 6 6 6 6 6 6 6 1 1 1 1 1 1 1 1
symmnumber: 1
zpe: 425987.5 jmol-1
zpe.correction: 0.162250 hartree
zpe.thermalcorrener: 0.175215 hartree
zpe.thermalcorrenthalpy: 0.176159 hartree
zpe.thermalcorrgfe: 0.121613 hartree
zpe.sumelectzpe: -1456.377726 hartree
zpe.sumelectthermal: -1456.364761 hartree
zpe.sumelectthermalent: -1456.363817 hartree
zpe.sumelectthermalfe: -1456.418364 hartree
dipole: -1.9221 -0.3005 1.3057
dipole: 2.3430
quadrupole: -98.8440 -94.9641 -101.2989
quadrupole: -7.0916 -6.8320 4.1732
quadrupole: -0.4750 3.4049 -2.9299 -7.0916 -6.8320 4.1732
hfenergy: -1456.539976 hartree
pointgroup: C01 [X(C12H8Cl2O1)]
dipole: 0.7282652 -0.3668584 -0.4298723 debye
dipolederiv: -0.2310553 -0.1951879 0.0514051 -0.1977617 -0.5982735 0.1716228 0.0782166 0.173324 -0.1108474 -0.9849305 -0.0444485 0.0569917 -0.0186746 -0.1230651 0.0209542 0.0412961 0.0251036 -0.0731532 -1.7833703 0.0834261 0.0721814 0.0857749 -0.3641317 -0.1396992 0.0646703 -0.139402 -0.1288548 -0.0637492 -0.0301475 0.0333441 0.0538283 -0.072189 0.0251732 -0.022431 0.0559 -0.1249481 0.5607658 -0.1283218 0.0017797 -0.0778984 -0.2364094 0.1132212 -0.0373763 0.0969633 -0.040643 0.1433339 0.0170017 -0.0772147 0.0666965 -0.0537719 -0.0885937 -0.03802 -0.0535157 0.0790817 0.1782534 -0.0520453 0.0361636 -0.1567956 -0.0843807 -0.0769628 0.0385708 -0.0751773 0.0829455 0.1880794 0.3337656 -0.0851441 0.2773074 0.863384 -0.2780454 -0.0975948 -0.307124 0.0250946 -0.0852068 0.0650481 -0.0309734 -0.0332787 0.058439 -0.0473691 0.015781 -0.0644689 -0.1138783 -0.4334414 0.0179197 0.0082971 0.1455603 -0.1763629 -0.0831897 -0.3405479 -0.0539692 -0.0082403 -0.4161313 0.0214287 0.0120695 -0.1062525 -0.1344712 -0.0618017 0.3639019 -0.0994723 -0.0146167 -0.4245503 -0.1396261 0.0540327 -0.1376043 -0.2075306 0.0428106 0.033738 0.0573627 -0.0786013 -0.3530014 0.0253041 0.0003597 0.0761425 -0.0183516 -0.0410412 0.0254026 -0.0320921 -0.0994552 1.663375 -0.0846542 -0.0987808 -0.078627 0.0850566 0.0052504 -0.0992848 0.0054257 0.0914561 1.3362833 0.0438763 -0.0749774 0.0433702 0.1576443 -0.0814854 -0.0661037 -0.0820165 -0.0371802 0.0675258 0.0278147 -0.0728521 0.0226826 0.1052009 0.0657469 -0.0843751 0.0493811 0.0148667 0.0569901 -0.0341716 0.0936919 -0.0264363 0.1191169 0.0563851 0.0934366 0.0433339 -0.009476 0.0351237 0.0741432 -0.019965 0.079499 -0.003103 0.0365635 -0.0199622 0.050194 0.1273413 -0.0433997 -0.0207487 0.1008093 -0.0353293 0.1432409 0.0717568 0.1016159 0.0676581 -0.0144772 0.0295221 0.0358381 -0.060446 0.048963 0.1395725 0.0665027 -0.0663042 0.0681746 0.0195295 0.0672285 0.0354005 -0.0077283 0.0421626 0.0538944 0.0392014 -0.0079328 0.0375383 0.1555107 0.0474492 -0.055307 0.0246027 -0.0609502 0.018739 0.0565635 0.0222189 0.0541824 0.1486282 0.444906 0.0036918 -0.0176469 -0.0123786 0.327752 0.126436 0.0010843 0.1226963 0.1099174 unknown
polarizability: 259.0404013|0.6766159|116.7455276|-12.0640648|-32.4709645|98.3686359 unknown
InChI: InChI=1S/C12H8Cl2O/c13-9-3-6-11(12(14)7-9)8-1-4-10(15)5-2-8/h1-7,15H
charge 0 multiplicity 1
23 atoms
Cl -0.724797 2.606744 -0.879054
Cl -5.336284 -0.1973 0.259845
O  5.054759 -0.438712 -0.10653
C  0.819026 -0.126903 -0.04502
C  -0.670542 -0.089182 0.01246
C  1.542722 0.306677 -1.186969
C  1.554205 -0.663393 1.049112
C  -1.476112 1.023087 -0.35305
C  -1.37392 -1.241604 0.47189
C  2.947715 0.211619 -1.237498
C  2.957393 -0.758607 1.015695
C  -2.884007 1.009516 -0.285748
C  -2.779558 -1.29469 0.559015
C  3.655818 -0.319262 -0.131949
C  -3.516451 -0.160893 0.17044
H  1.005317 0.706627 -2.051453
H  1.020536 -0.984371 1.950806
H  -0.791125 -2.128624 0.740913
H  3.485396 0.544794 -2.13447
H  3.523253 -1.157151 1.86241
H  -3.463274 1.891222 -0.568755
H  -3.286139 -2.198503 0.907377
H  5.455567 -0.093992 -0.942965
