program: Gaussian 09
title: 000017286
version: EM64L-G09RevD.01
frameworkgroup: C1[X(C7H4ClNO4)]
method: RPBEPBE
basis: SDD
operation: Freq
keyword: #p
keyword: freq=noraman
keyword: PBEPBE/SDD
title: #p freq=noraman PBEPBE/SDD
converged: YES YES NO NO
title: Mulliken charges:
elementType: Cl O O O O N C C C C C C C H H H H
charge: -0.004914 -0.404536 -0.213211 -0.190513 -0.181797 0.023795 0.254673 0.282043 -0.309254 -0.322614 -0.120911 -0.184020 0.116240 0.296546 0.289303 0.272912 0.396259
chargesum: 0.00000
title: Mulliken charges with hydrogens summed into heavy atoms:
elementType: Cl O O O O N C C C C C C C
charge: -0.004914 -0.008277 -0.213211 -0.190513 -0.181797 0.023795 0.254673 0.282043 -0.012708 -0.033311 -0.120911 0.088892 0.116240
polarizability: 1.59404382e+02 -2.35490036e+00 1.18650643e+02 3.15306986e-01 -9.10686674e+00 5.08270909e+01
1716.lowfreq: 0.0008 0.0025 0.0026 4.5284 6.7654 12.0806 32.7943 81.4709 94.5963
frequency: 32.7829 81.4674 94.5962 127.8616 158.5399 183.6499 243.3677 294.6683 308.9050 345.4566 362.2958 427.8455 483.7653 534.5181 579.7232 594.0898 603.1643 656.5802 671.2041 709.5949 757.5284 759.4561 826.9974 844.0516 907.1936 973.5507 1025.4085 1060.5152 1091.6737 1142.0642 1163.9598 1220.4643 1258.8168 1305.9165 1372.4416 1389.5355 1398.3595 1457.0881 1571.4996 1600.0627 1650.1173 3172.2576 3176.7859 3189.2803 3526.0897
redmass: 13.7877 9.3504 12.2276 5.6875 10.8990 9.9754 8.2980 16.4622 6.0692 7.9741 7.9703 3.5894 5.5217 3.3332 2.7759 2.2997 5.9174 4.5935 7.5526 6.9036 4.7266 8.7342 6.9360 1.4905 1.4554 1.3584 5.2078 3.6084 2.0229 1.9180 1.7062 9.7803 1.3230 2.4430 7.8026 6.6593 6.2789 2.7558 7.2722 8.0980 10.0287 1.0895 1.0934 1.0976 1.0644
irintensity: 1.1616 2.4321 1.8357 1.3557 0.7397 4.6381 0.0813 0.6323 1.1058 3.8534 2.1362 4.8054 9.5547 37.6039 61.1259 79.0465 18.0161 7.4936 8.3721 43.0009 10.6928 10.0095 62.7593 32.8699 20.1174 2.2168 120.8671 37.9232 61.2481 3.4959 105.7129 251.7808 0.4794 77.4000 144.7061 2.9724 66.4655 7.5356 88.9656 11.1682 228.6171 0.7254 1.9457 1.0831 55.0066
temp: 298.150 k
press: 1.00000 atm
elementType: 17 8 8 8 8 7 6 6 6 6 6 6 6 1 1 1 1
symmnumber: 1
zpe: 271164.7 jmol-1
zpe.correction: 0.103281 hartree
zpe.thermalcorrener: 0.114643 hartree
zpe.thermalcorrenthalpy: 0.115587 hartree
zpe.thermalcorrgfe: 0.064473 hartree
zpe.sumelectzpe: -1083.837665 hartree
zpe.sumelectthermal: -1083.826303 hartree
zpe.sumelectthermalent: -1083.825359 hartree
zpe.sumelectthermalfe: -1083.876474 hartree
dipole: -2.6832 -0.4993 1.3383
dipole: 3.0397
quadrupole: -85.7708 -78.7680 -83.2258
quadrupole: 10.4848 3.5276 6.5433
quadrupole: -3.1826 3.8202 -0.6376 10.4848 3.5276 6.5433
hfenergy: -1083.940946 hartree
pointgroup: C01 [X(C7H4Cl1N1O4)]
dipole: 1.0979599 0.1029307 0.4626917 debye
dipolederiv: -0.8355196 0.1727485 0.0575738 0.2077547 -0.1423493 -0.0169429 0.0568157 -0.0195649 -0.0385877 -0.7038175 0.0394547 0.4538198 -0.0274135 -0.3719782 0.0515003 0.4829715 0.1343669 -0.8561131 -0.4794597 -0.1899382 0.0689934 -0.1259109 -0.8474886 -0.3345632 0.1473573 -0.1172615 -0.6080815 -0.5418126 0.2072942 0.0242059 0.2023391 -0.6861456 -0.253872 -0.0170392 -0.197175 -0.3421248 -0.7316453 -0.0790947 -0.1758107 -0.063049 -0.4788694 -0.1638651 -0.1415146 -0.1990445 -0.3478893 1.5298515 -0.3241409 0.1596069 -0.2965172 0.938148 0.485157 0.1387784 0.4007042 0.4979923 -0.0188072 -0.1751867 0.0398911 -0.4102585 -0.0660398 0.0030788 -0.1227266 -0.0258626 -0.0052833 -0.506589 0.207572 0.0059573 0.2272465 0.0356812 -0.0891109 0.066396 0.0250116 0.0205625 -0.5065482 0.0465499 0.0173512 -0.1132912 -0.0178752 0.0090303 -0.0341876 -0.0045584 -0.0641104 0.1341323 -0.1833149 -0.0240273 0.0966824 -0.035422 0.0056318 0.0792906 0.0053155 -0.0821713 1.3581734 -0.2962314 -0.10851 -0.2721814 0.2345637 0.0368166 -0.0956472 0.0465126 -0.0388168 -0.269631 0.239656 0.0262967 0.235296 -0.1314422 -0.0077584 0.0439757 -0.0174201 -0.0870293 1.0382301 0.416474 -0.5493296 0.4254027 1.1985516 0.3532922 -0.5282372 0.1058821 1.1122165 0.1053377 0.009501 0.0012168 0.0239727 0.0470192 -0.0049502 0.0295601 -0.0034717 0.1568138 0.0948686 0.0414785 0.0095124 0.007809 0.0516784 0.0013344 -0.0310974 -0.0120985 0.1670879 0.030391 -0.0513302 0.000347 -0.0490909 0.0584888 -0.0030007 0.0007938 -0.000279 0.1646178 0.3028454 -0.0814917 -0.0070948 -0.0687905 0.2134793 -0.071778 -0.0754892 -0.1210566 0.3509165 unknown
polarizability: 158.5154644|-3.9696548|117.8808127|-6.952411|13.082338|52.4858387 unknown
InChI: InChI=1S/C7H4ClNO4/c8-4-1-2-6(9(12)13)5(3-4)7(10)11/h1-3,10H
charge 0 multiplicity 1
17 atoms
Cl 4.11243 -0.542043 -0.271861
O  -1.860064 -1.56392 1.123165
O  -0.98827 -2.757543 -0.677572
O  -1.955488 2.349067 0.591677
O  -2.543146 0.505846 -0.624552
N  -1.68833 1.222963 0.021803
C  0.022342 -0.634449 -0.023746
C  -0.28338 0.747317 0.064434
C  1.377769 -1.017557 -0.136704
C  0.728155 1.728699 0.094729
C  2.382865 -0.030465 -0.12564
C  2.079336 1.340402 0.003714
C  -0.990066 -1.743894 0.051228
H  1.630786 -2.077801 -0.222842
H  0.446875 2.782136 0.172705
H  2.876292 2.088466 0.016687
H  -2.546204 -2.284827 1.130374
