program: Gaussian 09
title: 000196179
version: EM64L-G09RevD.01
frameworkgroup: C1[X(C12H22O10S)]
method: RPBEPBE
basis: SDD
operation: Freq
keyword: #p
keyword: freq=noraman
keyword: PBEPBE/SDD
title: #p freq=noraman PBEPBE/SDD
converged: NO YES NO NO
title: Mulliken charges:
elementType: S O O O O O O O O O O C C C C C C C C C C C C H H H H H H H H H H H H H H H H H H H H H H
charge: 0.229857 -0.242031 -0.458202 -0.521721 -0.456129 -0.445336 -0.456036 -0.455509 -0.453650 -0.468220 -0.246354 -0.162079 -0.074207 -0.092968 -0.383049 -0.052640 -0.434448 -0.136600 -0.369423 -0.104813 -0.130517 -0.338491 -0.066652 0.228637 0.258769 0.223001 0.250980 0.234482 0.318877 0.248796 0.222908 0.187474 0.242055 0.216281 0.365628 0.409027 0.365661 0.213521 0.269806 0.356056 0.357231 0.382007 0.228700 0.370949 0.368370
chargesum: 0.00000
title: Mulliken charges with hydrogens summed into heavy atoms:
elementType: S O O O O O O O O O O C C C C C C C C C C C C
charge: 0.229857 -0.242031 -0.092574 -0.112694 -0.090468 -0.089279 -0.098805 -0.073502 -0.082701 -0.099850 -0.246354 0.066559 0.184562 0.130033 -0.132069 0.181842 -0.115571 0.112195 0.060107 0.118094 0.085765 0.144836 0.162048
polarizability: 2.29578773e+02 1.00543430e+00 1.95799149e+02 8.67491588e-01 -6.85612534e-01 1.38589655e+02
1716.lowfreq: -14.4942 -12.2749 -5.4781 -0.0012 -0.0003 0.0007 32.2194 38.7677 52.0773
frequency: 32.1315 38.7378 51.9312 60.2556 84.0542 90.3974 100.4450 114.1814 123.3921 129.0037 143.1101 152.2951 163.6815 173.0693 186.5808 201.5962 213.3781 218.5942 233.8597 259.1705 281.1924 283.8104 292.4489 295.7975 310.9038 315.6444 328.8996 335.5507 394.9510 404.5091 407.7348 420.9162 426.9445 437.9727 452.1578 453.8222 506.1009 517.8842 543.6240 550.6234 571.9254 583.3325 597.9749 629.8320 667.0526 710.8988 725.0846 736.2431 785.0682 795.1696 823.3954 836.3507 883.1996 893.7493 925.6832 952.0079 953.2359 964.2454 978.3652 988.1999 1006.1272 1010.4344 1014.2851 1032.0674 1034.3184 1042.8467 1049.7149 1051.4321 1065.1690 1079.4354 1086.0755 1092.6250 1113.1453 1156.1921 1168.1734 1170.9608 1189.5629 1191.6146 1210.7463 1221.7512 1227.4369 1246.1722 1250.6794 1263.4777 1265.0997 1282.6086 1296.0052 1299.8827 1310.2409 1317.2171 1321.6877 1323.6537 1326.9833 1333.6367 1338.7422 1345.3359 1359.4764 1368.0095 1376.2839 1379.7264 1392.1040 1394.3357 1399.7362 1409.2477 1461.2636 1461.4821 1565.5994 2895.3810 2953.6878 2955.6312 2964.1481 2966.1873 2973.0647 2984.3252 3008.0169 3011.4480 3027.8763 3035.1632 3035.9669 3099.5501 3103.5002 3127.8970 3251.4991 3375.4243 3471.0710 3536.7247 3545.8354 3564.3466 3566.5305
redmass: 6.5480 7.5186 7.4504 6.5788 7.1275 6.9420 6.6902 6.2637 6.5791 4.7266 5.7730 4.7330 5.1764 6.0194 6.3253 4.6927 4.3550 4.1936 5.3383 4.5347 3.4388 3.6812 3.8628 1.3936 4.2695 4.7048 4.2213 5.3371 3.7173 4.0920 1.2644 1.6827 5.0435 1.6487 3.1623 2.2124 3.8903 4.3286 1.6813 2.6268 2.8107 1.6735 1.8489 4.0862 3.7264 2.6436 1.3478 3.8967 4.2522 3.5891 3.3666 3.0558 1.1463 2.1265 2.9953 2.1782 5.3388 5.2492 4.0419 3.8690 4.5300 2.9649 3.5163 2.8455 3.3199 3.2123 3.4534 2.8965 2.9127 4.6284 3.0224 2.7332 2.1252 1.1297 1.2326 1.1335 1.2002 1.1992 1.2212 1.1489 1.2776 1.1477 1.1735 1.1755 1.2212 1.2199 1.2615 1.2817 1.2489 1.3559 1.2593 1.2602 1.3403 1.2463 1.2412 1.2235 1.2861 1.4592 1.2832 1.3607 1.3769 1.7015 1.2819 1.2761 1.0832 1.0765 7.1046 1.0809 1.0736 1.0793 1.0836 1.0829 1.0845 1.0841 1.0729 1.0859 1.0791 1.0876 1.0873 1.0935 1.0720 1.1000 1.0681 1.0642 1.0671 1.0649 1.0656 1.0657 1.0663
irintensity: 0.8004 0.1880 0.4940 0.4377 1.4044 1.1663 3.5912 0.3631 5.7331 17.7373 22.8010 5.4300 4.0215 14.7986 4.2974 5.0819 1.9419 22.6371 13.0770 26.8181 43.6685 7.5407 15.6761 94.3009 25.3373 25.8603 33.6767 4.1235 13.2309 3.4466 127.5091 89.2614 32.8912 198.1806 76.6309 73.8555 51.4248 9.3853 109.3204 11.3317 2.2556 172.0032 57.6618 1.9454 35.2857 34.0411 92.0729 34.0819 36.1233 22.3907 15.3924 67.8304 55.1218 59.1773 84.8384 12.0997 26.5838 59.9578 21.9103 98.2225 62.9522 38.4935 21.5911 40.9789 47.0776 104.6787 223.8280 3.0857 12.1488 9.7765 37.5244 23.5315 13.4276 17.2310 2.4329 18.5774 38.8504 6.6269 27.6616 22.8167 34.3960 45.0576 2.4716 14.0959 0.8006 44.6435 21.3837 3.4082 33.2260 25.5464 20.9258 10.6490 5.4474 28.9590 26.9646 7.3159 24.2743 49.6218 32.6171 4.8259 24.6579 17.2805 22.3164 40.3191 5.5359 21.0545 134.0501 50.0423 34.8718 6.6675 7.8639 5.2828 27.0964 88.1569 26.3637 45.4171 92.5641 16.1340 16.2550 17.5623 355.3703 10.4989 404.8745 45.9220 119.5647 18.7417 19.9130 18.8468 8.9589
temp: 298.150 k
press: 1.00000 atm
elementType: 16 8 8 8 8 8 8 8 8 8 8 6 6 6 6 6 6 6 6 6 6 6 6 1 1 1 1 1 1 1 1 1 1 1 1 1 1 1 1 1 1 1 1 1 1
symmnumber: 1
zpe: 924046.1 jmol-1
zpe.correction: 0.351951 hartree
zpe.thermalcorrener: 0.377164 hartree
zpe.thermalcorrenthalpy: 0.378108 hartree
zpe.thermalcorrgfe: 0.298158 hartree
zpe.sumelectzpe: -1618.832683 hartree
zpe.sumelectthermal: -1618.807471 hartree
zpe.sumelectthermalent: -1618.806526 hartree
zpe.sumelectthermalfe: -1618.886476 hartree
dipole: -5.9777 -3.3434 -1.8630
dipole: 7.0980
quadrupole: -129.9720 -152.7590 -152.9904
quadrupole: -16.2074 3.4632 -7.6863
quadrupole: 15.2685 -7.5186 -7.7499 -16.2074 3.4632 -7.6863
hfenergy: -1619.184634 hartree
pointgroup: C01 [X(C12H22O10S1)]
dipole: -1.9417315 0.9024587 1.7926743 debye
polarizability: 226.3132666|-9.8669062|169.4461086|-3.9148218|30.0519417|168.2082015 unknown
InChI: InChI=1S/C12H22O10S/c13-1-4(16)7(18)11(5(17)2-14)23-12-10(21)9(20)8(19)6(3-15)22-12/h1,4-12,14-21H,2-3H2
charge 0 multiplicity 1
45 atoms
S  -0.838732 -0.41451 0.850009
O  1.267251 -1.345583 -0.54009
O  4.280427 0.910328 1.300349
O  1.453935 1.728941 1.592117
O  4.847913 -0.492632 -1.141378
O  -3.79389 -0.250961 0.874216
O  -0.791673 3.144874 0.501951
O  1.660719 -2.784862 -2.962642
O  -2.781343 0.034094 -2.710584
O  -0.734871 2.31075 3.057946
O  -1.289791 -2.109085 -2.198668
C  3.207243 0.588132 0.354781
C  1.851806 0.420149 1.060391
C  3.635674 -0.714125 -0.354739
C  0.824632 -0.086788 0.029153
C  2.527466 -1.170385 -1.323931
C  -1.872554 0.953981 0.013243
C  -3.232619 0.346518 -0.344947
C  2.733769 -2.521366 -2.00953
C  -1.921499 2.270032 0.833031
C  -3.124354 -0.692978 -1.504341
C  -2.037171 2.084232 2.386553
C  -2.13741 -1.856741 -1.293606
H  3.113314 1.396624 -0.404468
H  1.947636 -0.321203 1.879606
H  3.804763 -1.492834 0.420992
H  0.668765 0.680857 -0.75829
H  2.363947 -0.390491 -2.098833
H  -1.377287 1.179492 -0.948563
H  -3.889541 1.15633 -0.729746
H  -2.801856 2.838854 0.4794
H  2.799944 -3.315126 -1.233866
H  3.669351 -2.502917 -2.589946
H  -4.131105 -1.165028 -1.615802
H  4.018927 1.731459 1.790167
H  0.733074 1.640224 2.30365
H  5.511056 -0.060831 -0.542143
H  -2.773346 2.798748 2.799169
H  -2.335528 1.059581 2.647819
H  -4.740356 -0.50123 0.724591
H  0.079679 2.678541 0.70198
H  0.779115 -2.696502 -2.506112
H  -2.299958 -2.521708 -0.42494
H  -2.067176 -0.498367 -3.170632
H  -0.521048 3.274514 2.950586
