program: Gaussian 09
title: 000187860
version: EM64L-G09RevD.01
frameworkgroup: C1[X(C10H6NO4)]
method: RPBEPBE
basis: SDD
operation: Freq
keyword: #p
keyword: freq=noraman
keyword: PBEPBE/SDD
title: #p freq=noraman PBEPBE/SDD
converged: NO YES NO YES
title: Mulliken charges:
elementType: O O O O N C C C C C C C C C C H H H H H H
charge: -0.324317 -0.317659 -0.337794 -0.377998 -0.256911 0.172129 0.215738 0.129678 0.161100 -0.382264 -0.452813 -0.384453 -0.262507 -0.221816 0.123272 0.270199 0.286369 0.244478 0.211467 0.211813 0.292291
chargesum: -1.00000
title: Mulliken charges with hydrogens summed into heavy atoms:
elementType: O O O O N C C C C C C C C C C
charge: -0.324317 -0.317659 -0.337794 -0.377998 0.035380 0.172129 0.215738 0.129678 0.161100 -0.112065 -0.166444 -0.139975 -0.051040 -0.010004 0.123272
polarizability: 3.11898961e+02 2.34741075e+01 1.70020828e+02 2.15439311e-02 -1.55325941e-02 5.13551822e+01
1716.lowfreq: -5.7577 -5.3987 0.0009 0.0012 0.0012 7.8802 52.8924 67.5579 119.2131
frequency: 52.8457 67.5443 119.2073 138.0545 174.0677 221.4171 262.9856 270.4835 275.6060 319.5798 365.7787 424.4803 493.0971 496.5530 498.9788 524.1594 575.6389 592.6764 650.5641 657.2197 665.6691 713.0856 748.6829 766.6993 791.4135 828.3576 859.8944 875.5958 878.1015 943.6153 976.5971 987.7648 1021.1969 1069.0270 1119.2132 1153.8379 1188.6089 1202.1051 1206.1936 1237.5101 1260.3893 1310.2344 1394.8294 1429.7066 1453.7312 1472.1030 1503.6083 1549.9834 1573.2622 1596.7884 1602.2663 3116.3301 3134.3943 3150.0960 3161.4907 3187.4224 3325.6538
redmass: 9.8880 7.3676 8.0745 5.7957 5.2852 6.2262 8.1932 5.9247 9.5338 9.5217 10.7864 3.4736 7.9519 10.3034 5.5722 4.2229 6.6713 7.2625 1.7773 2.9238 3.3084 5.8874 2.2900 1.6810 7.8400 6.1710 1.4322 1.4523 7.4713 1.3625 1.3090 6.0970 2.0509 3.0532 1.6303 1.1300 6.5154 3.5458 2.4027 2.0037 2.1873 4.3687 10.2370 2.6605 2.6114 1.8355 9.6090 4.1642 5.1065 7.2930 7.3962 1.0846 1.0898 1.0947 1.0986 1.0902 1.0753
irintensity: 0.0111 2.3799 2.6831 5.9120 12.9474 4.0397 2.3045 2.8585 4.0099 11.4330 0.9816 1.2950 3.4691 5.0003 0.3331 3.2119 5.6522 6.0556 50.3265 38.0291 6.6724 3.0551 39.8021 59.7683 22.6899 17.7004 0.1677 31.2711 14.9287 4.3917 0.8960 10.8862 46.7068 2.8294 52.3320 2.7605 23.5531 79.2013 284.7063 125.7799 144.8631 114.0077 43.7418 14.3160 3.8454 238.3344 41.4302 414.6370 128.9998 213.5923 106.5094 7.2946 28.9866 23.1808 26.8305 1.6963 6.4603
temp: 298.150 k
press: 1.00000 atm
elementType: 8 8 8 8 7 6 6 6 6 6 6 6 6 6 6 1 1 1 1 1 1
symmnumber: 1
zpe: 368667.5 jmol-1
zpe.correction: 0.140418 hartree
zpe.thermalcorrener: 0.152381 hartree
zpe.thermalcorrenthalpy: 0.153325 hartree
zpe.thermalcorrgfe: 0.101754 hartree
zpe.sumelectzpe: -739.286428 hartree
zpe.sumelectthermal: -739.274465 hartree
zpe.sumelectthermalent: -739.273521 hartree
zpe.sumelectthermalfe: -739.325092 hartree
dipole: 10.6365 -5.3896 0.0038
dipole: 11.9241
quadrupole: -149.6036 -106.5418 -89.9862
quadrupole: -9.9313 -0.0126 0.0017
quadrupole: -34.2264 8.8354 25.3910 -9.9313 -0.0126 0.0017
hfenergy: -739.4268459 hartree
pointgroup: C01 [X(C10H6N1O4)]
dipole: 4.2500865 1.9861857 -0.0014819 debye
dipolederiv: -1.2843385 -0.3283323 0.0000952 -0.3599998 -0.5084373 0.0000492 0.0000704 0.0000119 -0.1338859 -0.9295742 0.4375298 -0.0000112 0.6916934 -1.2892198 0.0000425 -0.0000296 0.0000706 -0.3964143 -0.9495028 -0.4700986 0.0001556 -0.9252879 -0.7867342 0.0002102 0.000998 0.0005142 -0.4119228 -1.6039571 0.7839348 -0.0000317 0.6749209 -0.7208873 -0.0000108 0.0004304 -0.0003253 -0.3459605 1.2873723 -0.6305062 -0.0002571 -1.2607396 0.154368 0.0002109 -0.0003038 0.0003732 -0.2529757 -0.0115753 -0.1257251 0.0000089 0.1811027 -0.3039883 0.0000174 -0.0000465 0.0000363 -0.0115003 0.857011 0.2186921 -0.0000475 -0.0801651 0.1363012 0.0000048 0.0000176 -0.0000137 0.1237292 1.2317736 -0.6498897 0.0000027 -0.5052687 1.2110454 -0.0000822 -0.0000108 -0.0001161 0.1121042 1.0521449 -0.3603825 0.0000396 -0.0728382 1.000871 -0.0000321 0.0001547 -0.0000435 0.0225048 0.076406 0.0210289 -0.0000187 0.1942388 0.0960817 -0.0000439 -0.0000217 -0.0000254 -0.1384643 -0.8637961 0.6872294 -0.0000019 0.2189906 -0.5314932 0.0000246 -0.000051 0.0000437 -0.1968613 0.0655329 -0.0207486 -0.0000167 -0.2117243 -0.0387475 -0.00001 -0.0000034 -0.0000333 -0.2125784 0.0284679 -0.0303208 -0.0000033 -0.4578001 -0.1923728 0.0000349 0.0000478 -0.0000006 -0.2111288 -0.3888724 -0.0801613 0.0000309 0.154926 0.1369838 -0.0000466 -0.0000263 -0.0000287 -0.1801862 0.428033 0.6855847 -0.0001874 1.9481342 0.5061101 -0.000535 -0.001388 -0.0006653 0.1026747 0.1031999 0.022964 -0.0000007 0.1164792 0.0069744 0.0000095 -0.0000033 0.0000185 0.1541206 0.0438664 -0.037951 0.0000081 -0.0196491 0.0461287 0.0000019 0.0000063 0.0000284 0.163292 0.0437594 0.1014961 -0.0000077 0.0414868 -0.0368385 0.0000212 0.0000202 0.0000275 0.1763243 -0.217442 -0.0075058 0.0000189 -0.0120319 0.0789383 0.0000096 0.0000193 0.0000088 0.165633 -0.0159093 -0.1169472 0.0000221 -0.1448255 -0.0994818 0.0000351 0.0000157 0.0000327 0.1574029 0.0474002 -0.0998907 0.0002019 -0.1716423 0.1343981 0.0000888 0.000104 0.0000862 0.3140927 unknown
polarizability: 310.2619539|-27.9393897|171.6578359|-0.0220273|-0.0148391|51.3551822 unknown
InChI: InChI=1S/C10H6NO4/c12-7-5-9(10(13)11-14)15-8-4-2-1-3-6(7)8/h1-5,11H
charge -1 multiplicity 1
21 atoms
O  -0.475549 0.856638 -0.000143
O  1.367502 -2.930452 0.000206
O  -3.54279 -1.152047 0.001149
O  -4.3660 1.668212 0.00036
N  -3.107105 1.196743 -0.00017
C  1.574912 -0.51196 -0.000068
C  0.922358 0.749609 -0.000171
C  0.777929 -1.782789 0.000106
C  -1.266782 -0.339173 -0.000002
C  2.992479 -0.532401 -0.000123
C  -0.654851 -1.590901 0.000123
C  1.650317 1.961999 -0.00033
C  3.736101 0.665837 -0.00028
C  3.060505 1.9142 -0.000386
C  -2.735095 -0.151998 0.000046
H  3.469799 -1.518796 -0.000035
H  -1.323345 -2.454877 0.00023
H  1.105334 2.911378 -0.000411
H  4.831879 0.636397 -0.000321
H  3.631911 2.850128 -0.000513
H  -2.336411 1.887757 -0.00067
