program: Gaussian 09
title: 000196249
version: EM64L-G09RevD.01
frameworkgroup: C1[X(C16H23N5O6)]
method: RPBEPBE
basis: SDD
operation: Freq
keyword: #p
keyword: freq=noraman
keyword: PBEPBE/SDD
title: #p freq=noraman PBEPBE/SDD
converged: YES YES NO NO
title: Mulliken charges:
elementType: O O O O O O N N N N N C C C C C C C C C C C C C C C C H H H H H H H H H H H H H H H H H H H H H H H
charge: -0.338534 -0.258201 -0.461316 -0.368890 -0.398498 -0.258994 -0.148343 -0.407285 -0.619505 -0.440105 -0.082946 -0.184088 -0.492406 -0.489362 -0.377619 0.170010 -0.103366 0.205891 -0.569109 0.401353 0.158202 -0.135043 -0.398083 -0.484116 -0.516765 -0.246025 0.213505 0.298140 0.222274 0.273780 0.236466 0.263165 0.228329 0.282208 0.269380 0.255473 0.252758 0.430455 0.324329 0.378958 0.229410 0.225879 0.255807 0.384739 0.260966 0.278417 0.269051 0.255817 0.370037 0.383800
chargesum: 0.00000
title: Mulliken charges with hydrogens summed into heavy atoms:
elementType: O O O O O O N N N N N C C C C C C C C C C C C C C C C
charge: -0.338534 -0.258201 -0.091279 -0.368890 -0.014698 -0.258994 -0.148343 0.023170 0.083782 -0.055366 -0.082946 0.114052 0.003648 0.010269 0.132918 0.170010 0.166014 0.205891 -0.060878 0.401353 0.158202 0.094367 0.083604 -0.223151 0.030703 0.009792 0.213505
polarizability: 2.60791754e+02 -9.21612901e+00 2.40902361e+02 3.96344635e+00 1.94539998e+01 1.62781126e+02
1716.lowfreq: -5.4386 -4.7273 -2.4014 -0.0006 -0.0003 0.0006 14.1731 27.7790 32.2269
frequency: 14.0102 27.7338 32.1817 37.7413 42.7833 55.6787 63.7994 74.0582 90.0847 94.0731 107.5075 110.8246 123.8230 134.0553 157.2678 163.3771 168.0727 194.1594 204.8574 232.0801 242.2171 276.2703 287.6083 297.5236 312.0831 330.0300 343.9222 362.3289 385.0567 425.2770 444.5061 463.5120 480.0395 490.8064 504.9466 526.2745 556.0017 587.6292 597.6896 623.2692 634.6259 643.8139 655.4801 657.2967 671.0769 678.2843 695.5672 755.7115 767.3589 780.0435 790.1601 796.2975 803.4190 816.0215 837.7654 847.8015 865.6991 877.1199 896.0856 900.0854 906.2993 924.9165 934.1851 943.0137 961.4114 970.0586 988.7689 991.2474 1006.4045 1007.8964 1051.4199 1056.3421 1072.0632 1086.8691 1094.0179 1099.6168 1106.4742 1117.3643 1127.0952 1138.5855 1171.7480 1172.0557 1182.0500 1188.3371 1222.2624 1227.5631 1233.6704 1240.9894 1244.3512 1250.4888 1254.9020 1268.7240 1275.4762 1294.0380 1307.6057 1310.0591 1311.1592 1323.9099 1324.4186 1333.8309 1339.9885 1354.1933 1354.9210 1372.8923 1382.0150 1398.2831 1410.7712 1432.3688 1434.8931 1452.6660 1454.0359 1458.9134 1475.2313 1488.0704 1499.2668 1554.6933 1559.2787 1595.5989 1610.8936 1644.1276 1646.2719 2975.4382 2987.7959 2990.7875 3004.1145 3013.0763 3014.0413 3024.5392 3028.4894 3032.2379 3056.6769 3058.3167 3069.0926 3085.6960 3099.8021 3111.8839 3212.9937 3238.9330 3263.7400 3313.1618 3334.3946 3383.2464 3510.7017 3606.7610
redmass: 7.3325 6.1986 6.4560 6.4197 5.3177 5.5351 8.1489 7.3889 5.3543 4.7831 3.5089 4.8774 7.9524 5.4931 3.8268 5.0517 5.6655 3.7923 4.2786 3.7077 3.4182 3.0629 3.0944 2.9188 6.0088 5.2317 5.5781 6.5526 3.2013 3.0845 3.3785 1.5321 3.4412 2.7558 2.1793 2.6864 2.9785 3.7774 1.7699 3.6583 2.7470 3.1553 2.5183 2.0534 4.1121 2.7359 5.3822 3.8496 4.0136 2.7721 1.4082 1.4761 1.8641 1.4989 3.7292 3.1688 1.9009 1.1044 1.9334 5.6924 2.2078 2.4434 3.0810 3.5568 2.2811 1.5000 2.6092 2.7471 2.8024 2.6212 3.1978 2.9497 1.4567 2.2926 2.1855 2.5081 2.6442 1.9000 3.7120 1.8490 1.3036 1.1847 1.5237 1.2930 1.2352 1.4822 1.6525 1.4887 1.5488 1.5043 1.3431 1.6038 1.5678 1.3970 1.3140 1.4619 1.3615 1.3413 1.3900 1.3989 1.3696 2.6143 4.1670 1.9401 1.5385 2.1771 4.7160 1.0954 2.5886 1.0952 1.0838 1.1447 1.0910 1.1130 2.3771 3.4013 4.2673 4.8094 1.5244 6.7999 6.2142 1.0657 1.0833 1.0639 1.0624 1.0634 1.0724 1.0846 1.0778 1.0624 1.0987 1.0971 1.0982 1.1014 1.1023 1.1027 1.0979 1.0984 1.0911 1.0809 1.0604 1.0643 1.0640 1.0926
irintensity: 0.4875 0.8577 0.3173 0.9016 3.3373 1.1360 1.7111 7.7974 4.8699 0.8170 2.9029 5.6399 2.1107 0.6061 1.3193 0.8067 1.5351 0.5939 5.3602 12.3848 3.0078 8.1916 5.1698 22.9409 9.3395 10.7755 0.2662 39.5223 36.4220 14.6809 4.8448 51.7974 42.4819 14.2009 54.5101 16.7264 20.9980 12.1563 70.9200 0.0664 9.3184 13.0086 12.0388 136.3691 4.1337 109.9492 3.1336 0.6700 8.8436 3.8894 46.0518 96.1169 58.9041 12.8322 6.9284 7.7887 3.8398 87.3809 20.8729 28.3827 6.2013 8.2742 7.4683 12.7205 19.7743 125.4244 12.1481 10.9954 1.7545 6.3132 115.2099 198.4738 7.0656 33.2501 64.6393 9.8134 42.9573 0.9296 17.8613 30.5586 25.1563 3.2924 7.2383 14.7886 10.5479 3.3081 0.2853 29.8675 7.9110 9.9656 2.5263 9.3387 11.0319 14.2848 24.1549 5.2791 2.3428 12.0638 9.8528 2.0505 61.7617 41.9298 10.7826 68.4094 237.7947 106.3720 70.2819 66.2939 17.2335 19.1540 11.7280 18.3118 28.8154 28.9429 509.0968 233.5885 87.8944 62.6645 65.8959 458.1046 78.3430 23.5873 22.7388 14.7632 11.1142 14.9296 10.7030 14.8295 30.7427 14.7139 13.1665 7.4831 6.7706 11.3254 17.5678 9.8153 6.4849 16.1031 757.5385 224.6624 192.8755 74.0960 32.2071 65.9528
temp: 298.150 k
press: 1.00000 atm
elementType: 8 8 8 8 8 8 7 7 7 7 7 6 6 6 6 6 6 6 6 6 6 6 6 6 6 6 6 1 1 1 1 1 1 1 1 1 1 1 1 1 1 1 1 1 1 1 1 1 1 1
symmnumber: 1
zpe: 1047281.9 jmol-1
zpe.correction: 0.398889 hartree
zpe.thermalcorrener: 0.425233 hartree
zpe.thermalcorrenthalpy: 0.426177 hartree
zpe.thermalcorrgfe: 0.339406 hartree
zpe.sumelectzpe: -1346.622855 hartree
zpe.sumelectthermal: -1346.596510 hartree
zpe.sumelectthermalent: -1346.595566 hartree
zpe.sumelectthermalfe: -1346.682338 hartree
dipole: 4.1506 -5.1846 2.2177
dipole: 7.0018
quadrupole: -181.5088 -179.8991 -147.1331
quadrupole: -6.3867 -11.0712 8.1448
quadrupole: -11.9952 -10.3854 22.3806 -6.3867 -11.0712 8.1448
hfenergy: -1347.0217435 hartree
pointgroup: C01 [X(C16H23N5O6)]
dipole: -1.0649435 -2.5376751 -0.1212109 debye
polarizability: 253.7609135|18.7249003|225.8706714|10.4133034|-38.7603749|184.8436559 unknown
InChI: InChI=1S/C16H23N5O6/c17-14(25)11-2-1-5-21(11)16(27)10(6-9-7-18-8-19-9)20-15(26)12(22)3-4-13(23)24/h7-8,10-12,19-20,22-23H,1-6,17H2
charge 0 multiplicity 1
50 atoms
O  0.704318 -1.745011 1.002113
O  5.183337 -1.426515 1.805956
O  -4.618876 0.552036 -1.208738
O  -2.14568 1.451775 -1.422162
O  -4.265427 -3.898796 1.924705
O  -2.592074 -2.366529 1.476814
N  2.423485 -0.725306 -0.18568
N  -1.188774 -0.177281 -0.049825
N  3.039926 -1.972019 2.546754
N  -0.150741 3.348443 -1.020083
N  1.488568 4.898234 -0.813677
C  3.40654 -1.819489 0.114243
C  4.507233 -1.609119 -0.943935
C  4.494673 -0.077844 -1.181844
C  2.996433 0.29541 -1.121738
C  1.131371 -0.792501 0.250328
C  0.181461 0.350013 -0.154016
C  3.971272 -1.709845 1.569512
C  0.422285 1.623774 0.767188
C  0.686797 2.893909 0.008303
C  -2.23745 0.393109 -0.695254
C  -3.6239 -0.273013 -0.53995
C  -3.661432 -1.73126 -1.096895
C  1.691465 3.866394 0.117548
C  -4.407925 -2.707117 -0.16951
C  0.367699 4.548026 -1.483196
C  -3.651225 -2.940922 1.122961
H  2.882865 -2.789154 0.023095
H  4.252974 -2.155312 -1.870436
H  5.481059 -1.957309 -0.56756
H  4.946835 0.213676 -2.143598
H  5.048617 0.422809 -0.369494
H  2.518716 0.195856 -2.117106
H  2.822241 1.319962 -0.753791
H  0.359933 0.642918 -1.204799
H  1.275366 1.441553 1.44445
H  -0.471729 1.718708 1.413015
H  -1.331381 -1.010685 0.552694
H  3.327995 -1.920791 3.524188
H  2.057545 -2.144487 2.280938
H  -3.859385 -0.282225 0.54295
H  -2.640402 -2.112925 -1.279077
H  -4.181045 -1.67845 -2.068767
H  -0.980833 2.814946 -1.343338
H  2.531023 3.893396 0.810508
H  -5.416559 -2.325273 0.081376
H  -4.568247 -3.688216 -0.654396
H  -0.084687 5.121867 -2.288307
H  -4.111513 1.29254 -1.654425
H  -3.742648 -4.022964 2.763559
