program: Gaussian 09
title: 000187854
version: EM64L-G09RevD.01
frameworkgroup: C1[X(C16H15Cl2NO2)]
method: RPBEPBE
basis: SDD
operation: Freq
keyword: #p
keyword: freq=noraman
keyword: PBEPBE/SDD
title: #p freq=noraman PBEPBE/SDD
converged: YES YES NO NO
title: Mulliken charges:
elementType: Cl Cl O O N C C C C C C C C C C C C C C C C H H H H H H H H H H H H H H H
charge: -0.029749 -0.020583 -0.421558 -0.226221 -0.233244 0.237628 -0.363768 0.323531 0.569389 -0.337972 -0.559941 -0.354797 -0.711041 -0.256710 -0.247640 -0.263075 -0.273203 -0.259859 -0.258874 0.147442 -0.215871 0.241130 0.208387 0.246974 0.265750 0.269974 0.243574 0.226176 0.237247 0.221803 0.223243 0.226963 0.264639 0.260992 0.242531 0.376735
chargesum: 0.00000
title: Mulliken charges with hydrogens summed into heavy atoms:
elementType: Cl Cl O O N C C C C C C C C C C C C C C C C
charge: -0.029749 -0.020583 -0.044823 -0.226221 -0.233244 0.237628 0.085749 0.323531 0.569389 -0.090999 -0.024217 -0.111223 -0.025814 -0.256710 -0.247640 -0.039832 -0.046241 0.004780 0.002118 0.147442 0.026660
polarizability: 2.23300382e+02 3.37379604e+01 2.17010398e+02 -6.68619460e+00 -4.14183342e+00 1.66389949e+02
1716.lowfreq: -14.8202 -11.8059 -5.8783 -0.0017 -0.0010 -0.0008 19.2116 29.5750 52.2007
frequency: 19.0466 29.5347 52.1575 55.5771 58.2918 78.1056 97.0630 132.4002 141.1711 159.8745 166.7429 192.4852 198.0107 216.9875 256.2885 271.8697 288.1488 322.7073 328.7229 354.2130 369.0604 384.0081 443.3234 449.5886 467.4777 506.6131 522.3068 526.6897 542.7260 562.6961 579.0299 618.7333 633.3921 659.7555 710.5789 720.4984 727.9901 739.6728 758.7638 779.2604 804.2656 818.9298 850.4701 873.1207 894.1942 896.2376 924.5191 938.0933 956.6375 968.8037 976.8274 1037.1350 1047.1346 1062.8912 1067.7793 1079.5380 1103.6866 1119.5159 1136.4847 1151.5269 1182.9090 1188.1136 1193.5111 1207.7404 1215.1979 1250.7927 1267.3378 1301.2240 1312.8326 1329.8234 1341.0922 1367.2318 1383.5825 1399.4720 1414.8571 1427.5856 1433.8543 1447.6166 1474.4922 1479.8849 1490.9293 1497.1416 1550.2448 1580.2214 1583.9609 1612.5575 1671.6566 2925.5335 2977.3420 2996.3935 3035.3725 3040.3150 3082.9021 3116.3002 3129.1942 3150.4445 3153.1701 3171.1020 3171.3082 3178.5537 3183.3452 3507.4263
redmass: 6.9516 10.1820 8.0916 5.8329 3.4520 4.3068 8.0420 4.3360 2.8538 5.8810 3.5432 4.7863 5.0098 5.1980 3.6554 3.2990 1.6857 4.1467 4.8958 6.3590 4.1368 7.5200 3.1137 5.9332 4.2656 3.6465 4.5168 2.7452 4.3000 4.2249 3.8962 6.0235 3.1928 1.6735 4.3499 3.3959 7.5674 2.5918 1.6885 1.5300 3.1404 1.3425 1.3983 4.3978 3.7370 1.3628 1.8266 2.4551 1.8344 1.3329 1.3242 4.1356 2.5672 2.1913 3.8068 2.5109 2.1237 2.3847 1.6169 1.5147 1.0813 1.4014 1.8173 1.1908 2.5288 1.7489 2.0448 1.4292 1.5152 6.0412 2.7184 1.5477 2.8412 1.2411 2.2917 2.8704 1.5950 1.3836 1.0483 1.2660 1.2724 1.4595 6.6268 7.2182 6.8551 5.9677 8.1646 1.0681 1.0623 1.0373 1.0934 1.0938 1.0981 1.0999 1.0860 1.0916 1.0871 1.0934 1.0930 1.0968 1.0998 1.0638
irintensity: 0.0984 1.2141 0.1510 1.3769 0.2451 0.3654 1.6638 0.5208 2.8458 0.2703 1.4527 0.5808 1.4595 0.6546 1.0818 2.2290 1.0044 3.7735 4.0887 7.3090 3.2695 2.7233 12.7694 0.4578 3.2970 0.7974 5.7191 18.9645 16.6492 31.6028 4.3236 3.2939 27.2353 100.5438 12.5307 7.2511 59.0475 8.3875 83.0617 62.5079 2.7152 4.1296 2.8710 4.4463 6.2984 0.5610 2.4272 1.1210 10.2764 0.4883 1.5079 16.4503 309.8347 27.2873 5.2028 9.2866 3.0784 44.7006 3.7624 5.9858 0.6745 9.7078 1.7585 3.9499 32.6916 1.5717 87.1457 4.2391 21.1062 5.9133 41.1659 7.7901 20.7275 22.9726 42.9944 59.7091 3.8777 113.0674 11.4227 56.4907 33.5593 9.8911 23.7487 4.7380 2.3883 35.3858 178.6328 48.6071 21.8050 27.5545 10.9254 11.8787 39.4203 19.0942 5.6954 22.4498 2.6029 20.9998 1.1479 11.0437 6.6953 22.9220
temp: 298.150 k
press: 1.00000 atm
elementType: 17 17 8 8 7 6 6 6 6 6 6 6 6 6 6 6 6 6 6 6 6 1 1 1 1 1 1 1 1 1 1 1 1 1 1 1
symmnumber: 1
zpe: 713296.8 jmol-1
zpe.correction: 0.271680 hartree
zpe.thermalcorrener: 0.291754 hartree
zpe.thermalcorrenthalpy: 0.292698 hartree
zpe.thermalcorrgfe: 0.221236 hartree
zpe.sumelectzpe: -1742.496284 hartree
zpe.sumelectthermal: -1742.476210 hartree
zpe.sumelectthermalent: -1742.475266 hartree
zpe.sumelectthermalfe: -1742.546729 hartree
dipole: 3.7662 0.1860 -1.3886
dipole: 4.0184
quadrupole: -134.9770 -124.8287 -133.5876
quadrupole: 4.0444 0.9877 -9.2198
quadrupole: -3.8459 6.3024 -2.4565 4.0444 0.9877 -9.2198
hfenergy: -1742.7679641 hartree
pointgroup: C01 [X(C16H15Cl2N1O2)]
dipole: 1.4968921 0.1092154 -0.4967528 debye
polarizability: 234.1925328|28.9363741|197.2930301|12.3546745|17.1969244|175.2151661 unknown
InChI: InChI=1S/C16H15Cl2NO2/c1-2-19(16-12(17)7-5-8-13(16)18)14-9-4-3-6-11(14)10-15(20)21/h3-9,20H,2,10H2,1H3
charge 0 multiplicity 1
36 atoms
Cl 1.900299 0.35189 2.459008
Cl 0.7802 -1.188684 -2.837705
O  -1.134601 3.710368 0.999075
O  -2.971499 2.432622 1.595373
N  0.372562 -1.26638 0.257032
C  -1.002625 -1.102915 -0.157875
C  0.836586 -2.67548 0.488284
C  -1.679974 0.158751 -0.051122
C  1.377131 -0.355085 -0.220367
C  -1.733891 -2.230147 -0.629717
C  -0.967389 1.369187 0.536306
C  -3.024445 0.24838 -0.485074
C  2.205365 -2.815347 1.172629
C  2.191518 0.41797 0.659392
C  1.677963 -0.193664 -1.606478
C  -3.081171 -2.121334 -1.023853
C  -3.730707 -0.871134 -0.972365
C  3.203056 1.28941 0.215516
C  2.665343 0.685835 -2.090963
C  -1.834633 2.489689 1.080752
C  3.43427 1.428015 -1.169867
H  0.06651 -3.159323 1.115899
H  0.873121 -3.224285 -0.479441
H  -1.241353 -3.199969 -0.726997
H  -0.259963 1.826171 -0.179093
H  -0.349003 1.035088 1.394568
H  -3.546504 1.204877 -0.396005
H  3.01799 -2.356836 0.582185
H  2.209624 -2.369579 2.179584
H  2.434308 -3.892413 1.267959
H  -3.611154 -3.009771 -1.385373
H  -4.774668 -0.768231 -1.28602
H  3.784755 1.861172 0.943197
H  2.837825 0.770453 -3.167435
H  4.210002 2.110948 -1.529264
H  -1.685051 4.422352 1.426454
