program: Gaussian 09
title: 000196181
version: EM64L-G09RevD.01
frameworkgroup: C1[X(C12H20O10)]
method: RPBEPBE
basis: SDD
operation: Freq
keyword: #p
keyword: freq=noraman
keyword: PBEPBE/SDD
title: #p freq=noraman PBEPBE/SDD
converged: YES YES NO NO
title: Mulliken charges:
elementType: O O O O O O O O O O C C C C C C C C C C C C H H H H H H H H H H H H H H H H H H H H
charge: -0.262304 -0.270977 -0.269820 -0.295312 -0.442206 -0.457100 -0.442870 -0.433108 -0.439511 -0.458973 0.324802 -0.250671 0.234878 -0.148575 -0.204175 -0.406296 -0.096963 -0.139209 -0.040021 -0.339812 -0.334862 -0.405119 0.280175 0.280495 0.270174 0.246210 0.262741 0.271285 0.231531 0.226911 0.238545 0.200223 0.216859 0.221280 0.229283 0.239436 0.347731 0.370421 0.360058 0.366779 0.357223 0.360845
chargesum: 0.00000
title: Mulliken charges with hydrogens summed into heavy atoms:
elementType: O O O O O O O O O O C C C C C C C C C C C C
charge: -0.262304 -0.270977 -0.269820 -0.295312 -0.094474 -0.086679 -0.082811 -0.066329 -0.082289 -0.098129 0.324802 0.029504 0.234878 0.131920 0.065999 0.102655 0.174321 0.092322 0.186890 0.098956 0.103278 0.063600
polarizability: 1.83806273e+02 1.21411581e+00 1.58756611e+02 -2.08450286e+00 -2.73752767e+00 1.31435706e+02
1716.lowfreq: -1.6821 0.0006 0.0009 0.0010 5.7092 8.3307 25.3894 26.8091 50.9123
frequency: 25.1612 26.8004 50.8603 65.9854 69.0369 89.9572 97.5627 122.8151 138.4813 142.7754 168.1246 179.9172 192.9583 221.9031 226.2338 243.8750 250.2862 285.6510 306.4889 323.6442 327.4332 331.9354 339.3762 348.7037 367.9253 372.1412 380.0658 393.1992 424.7802 455.9859 472.9316 483.5462 504.4957 514.9979 538.0449 554.9352 565.8766 580.1285 607.3554 633.2136 662.1780 692.1854 738.7164 752.5785 802.2799 816.7354 887.1689 891.7107 936.6612 944.9379 956.5610 967.9070 975.6370 981.9366 991.4314 1008.1766 1016.7742 1021.8192 1029.2308 1043.2317 1053.2058 1059.8387 1066.9767 1075.8255 1083.9490 1091.1770 1128.2228 1133.7751 1153.1647 1154.9228 1157.8609 1179.5981 1204.6784 1222.0130 1224.2001 1237.3979 1244.3621 1251.1275 1256.9568 1268.0511 1284.0542 1289.1000 1295.3146 1304.4022 1310.6194 1314.2029 1341.2170 1343.6926 1347.4304 1360.3102 1373.9658 1380.7682 1390.7874 1394.5989 1404.8486 1406.7232 1446.8645 1460.0931 1472.7202 1476.3920 2959.7525 2965.0345 2973.8083 2978.9470 3007.7279 3013.7488 3022.6929 3031.9714 3050.1038 3064.9424 3068.8755 3079.6401 3099.3037 3123.7648 3483.7018 3494.7441 3536.1300 3564.0683 3580.4454 3591.6944
redmass: 6.2255 6.3303 6.1323 7.2899 6.2107 5.9337 3.9935 3.2142 4.3696 5.4627 3.6995 3.3107 3.9512 3.8741 1.5503 2.5788 3.9244 4.8153 3.7093 1.7838 2.1324 1.5992 2.9194 2.1507 3.8646 3.4771 4.6605 1.6967 2.9233 2.1567 1.9170 3.8057 3.2325 3.9618 3.3659 1.1346 5.3349 7.0824 5.3261 5.4034 4.0381 5.8956 4.4074 4.3647 3.3307 3.6711 1.8055 3.5493 5.1999 6.3191 6.8551 5.3040 5.2039 5.3170 4.2404 3.6002 3.4499 2.5948 3.6014 2.6335 1.9463 2.7765 3.1991 3.0158 2.9203 3.5794 2.3290 3.2590 1.8944 1.7392 1.6633 1.1859 1.2512 1.2926 1.3168 1.2034 1.2954 1.2515 1.3306 1.4942 1.2587 1.2900 1.3188 1.2677 1.3654 1.2130 1.3630 1.1972 1.2549 1.4057 1.4795 1.2600 1.5580 1.3527 1.4963 1.5061 1.0802 1.0848 1.0821 1.0814 1.0822 1.0682 1.0856 1.0644 1.0849 1.0621 1.0858 1.0629 1.0860 1.0905 1.0947 1.0956 1.1049 1.1021 1.0651 1.0651 1.0654 1.0661 1.0662 1.0669
irintensity: 0.3224 0.6054 1.3808 2.7408 4.5542 1.3270 9.5284 18.3644 13.0873 1.3240 1.0680 0.7032 18.6402 2.1444 96.6755 39.2509 58.6213 3.8011 1.3122 4.4894 53.3118 125.5447 26.7726 64.8809 2.8899 23.0596 11.0574 41.1324 24.5847 46.1590 65.4154 30.2816 15.1653 3.4085 8.4097 157.4389 45.3797 4.4187 5.2955 28.3986 13.3818 11.6485 50.9694 38.6451 172.0107 53.0931 22.2523 53.5037 226.3981 70.0720 92.4448 48.0998 78.1814 46.3231 62.8596 55.3997 15.0729 19.7051 60.8232 35.4870 12.8338 166.8500 17.3124 25.5440 28.8917 4.7215 24.6208 19.4163 20.4923 13.7517 35.6955 20.5424 27.7881 18.6278 43.5395 14.4696 14.7022 12.0754 40.8652 24.9227 2.5109 24.5653 57.3052 18.0948 4.7850 29.2944 4.0565 26.0568 14.6707 3.9225 5.5765 22.1260 17.4902 29.8360 13.3450 2.7334 10.4366 4.2592 8.0911 9.8295 2.8836 48.0847 52.0323 38.8515 23.2962 34.0039 2.4378 12.9808 8.2761 5.6399 19.2463 32.5829 21.1722 8.5410 18.2812 54.8477 10.2188 6.7247 22.3875 18.6998
temp: 298.150 k
press: 1.00000 atm
elementType: 8 8 8 8 8 8 8 8 8 8 6 6 6 6 6 6 6 6 6 6 6 6 1 1 1 1 1 1 1 1 1 1 1 1 1 1 1 1 1 1 1 1
symmnumber: 1
zpe: 866574.6 jmol-1
zpe.correction: 0.330061 hartree
zpe.thermalcorrener: 0.352714 hartree
zpe.thermalcorrenthalpy: 0.353658 hartree
zpe.thermalcorrgfe: 0.278402 hartree
zpe.sumelectzpe: -1219.665762 hartree
zpe.sumelectthermal: -1219.643109 hartree
zpe.sumelectthermalent: -1219.642165 hartree
zpe.sumelectthermalfe: -1219.717421 hartree
dipole: -7.4527 -1.9153 2.0624
dipole: 7.9664
quadrupole: -146.3060 -132.5752 -130.3615
quadrupole: 10.8479 3.7564 -3.7097
quadrupole: -9.8917 3.8391 6.0527 10.8479 3.7564 -3.7097
hfenergy: -1219.9958232 hartree
pointgroup: C01 [X(C12H20O10)]
dipole: 2.772077 -1.1221121 -0.9380457 debye
polarizability: 182.8001542|-4.0424908|159.5669193|-4.6889385|2.1643604|131.631517 unknown
InChI: InChI=1S/C12H20O10/c13-1-5-7(16)9(18)12(21-5)4-19-11(3-15)10(22-12)8(17)6(2-14)20-11/h5-10,13-18H,1-4H2
charge 0 multiplicity 1
42 atoms
O  0.205357 0.626282 -1.373168
O  -1.145315 1.071694 1.127235
O  -3.174476 0.44591 0.103693
O  1.195195 -0.691288 0.412755
O  -1.836079 -1.92262 -2.122633
O  2.58892 2.547337 0.003631
O  4.571846 0.144521 -0.807573
O  -2.609865 3.371988 0.774342
O  -4.201424 -1.481886 1.922072
O  4.462564 -2.519253 0.479607
C  0.977103 0.682486 -0.122324
C  -1.236244 0.35278 -1.238593
C  -1.953439 1.163048 -0.138893
C  -1.604391 -1.125231 -0.914712
C  2.383258 1.209728 -0.537053
C  0.253966 1.51732 0.940806
C  -2.935043 -1.027432 -0.142824
C  3.365341 0.156309 0.003116
C  2.528744 -1.138917 -0.063994
C  -2.260314 2.639217 -0.438206
C  -2.948131 -1.740271 1.214672
C  3.052786 -2.245128 0.854395
H  -1.652205 0.61257 -2.22858
H  -0.803203 -1.565424 -0.29227
H  2.440981 1.207641 -1.644039
H  0.732742 1.386191 1.921565
H  0.300356 2.582473 0.652973
H  -3.775587 -1.361992 -0.773203
H  3.591176 0.382954 1.068153
H  2.468267 -1.488989 -1.117371
H  -3.123718 2.695644 -1.122392
H  -1.379581 3.102861 -0.9305
H  -2.072238 -1.413146 1.812085
H  -2.908185 -2.833203 1.064672
H  2.433851 -3.160193 0.799066
H  3.079586 -1.893526 1.898426
H  -0.969353 -2.064397 -2.581015
H  3.460859 2.884728 -0.321312
H  5.123259 -0.615565 -0.477174
H  -2.218782 2.869864 1.540456
H  -4.319587 -0.496325 1.951647
H  4.493004 -3.233258 -0.204044
