program: Gaussian 09
title: 000182290
version: EM64L-G09RevD.01
frameworkgroup: C1[X(C25H24N6O5)]
method: RPBEPBE
basis: SDD
operation: Freq
keyword: #p
keyword: freq=noraman
keyword: PBEPBE/SDD
title: #p freq=noraman PBEPBE/SDD
converged: YES YES NO NO
title: Mulliken charges:
elementType: O O O O O N N N N N N C C C C C C C C C C C C C C C C C C C C C C C C C H H H H H H H H H H H H H H H H H H H H H H H H
charge: -0.320550 -0.430475 -0.480712 -0.218841 -0.282377 -0.222250 -0.450075 -0.015747 -0.476633 -0.265087 -0.465194 -0.087228 -0.106609 -0.509159 -0.048672 -0.359379 0.357640 -0.244009 -0.126304 0.325173 0.241170 -0.696034 0.167407 0.279084 0.244493 0.338075 -0.675282 0.079564 -0.580509 0.316163 -0.393986 -0.424880 -0.238897 -0.237764 0.199297 -0.808886 0.286035 0.239457 0.251772 0.270629 0.265785 0.220619 0.220576 0.269119 0.372072 0.360157 0.251072 0.250054 0.374643 0.226249 0.327442 0.307515 0.227729 0.242343 0.222690 0.224734 0.434464 0.292344 0.244622 0.235351
chargesum: 0.00000
title: Mulliken charges with hydrogens summed into heavy atoms:
elementType: O O O O O N N N N N N C C C C C C C C C C C C C C C C C C C C C C C C C
charge: -0.320550 -0.058403 -0.106069 -0.218841 -0.282377 -0.222250 -0.089917 -0.015747 -0.169118 -0.265087 -0.030730 0.198807 0.132848 0.013241 0.217113 0.081816 0.357640 0.025110 -0.126304 0.325173 0.241170 -0.194908 0.167407 0.279084 0.244493 0.338075 -0.449033 0.079564 -0.253067 0.316163 -0.166258 -0.182537 -0.016208 -0.013031 0.199297 -0.036569
polarizability: 5.05803883e+02 6.21852129e+01 4.33528453e+02 -2.01728977e+01 2.56269030e+01 1.80282480e+02
1716.lowfreq: -9.2469 -3.5371 -1.7912 -0.0010 -0.0007 -0.0004 7.4198 12.4179 24.7986
frequency: 2.5415 12.3140 24.6767 32.0331 43.0244 44.6523 63.1109 70.1464 78.4199 95.1506 108.0229 116.7568 119.3529 122.4455 133.0443 151.1417 157.5364 175.1639 187.4190 202.5435 224.0260 229.3447 233.5329 245.5353 250.4617 274.5722 283.6241 297.7362 303.8424 321.7546 333.1725 367.9887 375.3503 376.5595 385.9216 431.9571 437.3933 448.0647 451.1507 500.6314 505.8767 510.3445 511.6323 515.1645 522.8359 531.4181 549.6600 565.9504 590.6418 594.7158 609.7196 620.6865 630.2086 641.7775 644.5484 650.4634 657.1116 674.4047 691.3795 704.3318 722.9053 736.6668 744.0820 753.1936 762.6718 771.1633 775.1637 778.5758 793.7473 823.3515 825.6479 860.5956 862.9538 865.9541 872.5269 908.0337 917.2792 918.5439 943.1460 946.9748 968.3836 971.5532 974.9511 981.2755 982.8922 998.5526 1016.6020 1017.0192 1025.4277 1036.1132 1044.0995 1061.5497 1083.0694 1089.6858 1093.5565 1101.4393 1108.3106 1126.0007 1131.5119 1138.0716 1161.9071 1167.1516 1178.4005 1183.2785 1191.7467 1204.5559 1206.4513 1213.2284 1215.3808 1240.3343 1250.5382 1257.4717 1261.2028 1264.7051 1285.6605 1287.6804 1298.2387 1304.1306 1315.3902 1320.7512 1329.9411 1342.6692 1353.5500 1362.0035 1378.1304 1391.7094 1393.0782 1394.4992 1411.0605 1414.1573 1425.6874 1429.1498 1446.8845 1459.2118 1464.1165 1468.5312 1478.5141 1486.0398 1491.8925 1525.5328 1533.3980 1542.8759 1571.1020 1586.8134 1593.1541 1614.5002 1621.4232 1627.8608 1639.6278 1696.9256 2789.8755 2967.1795 2974.0236 2982.7764 2985.4812 3023.1324 3029.2645 3043.6193 3044.7613 3056.3424 3073.0159 3099.5195 3112.8893 3117.2749 3121.1172 3125.2308 3139.1583 3159.4810 3168.3808 3248.8197 3463.8390 3517.1787 3524.8318 3602.8814
redmass: 5.9095 6.2753 6.9933 5.9975 4.5342 5.8112 6.0868 3.1382 5.0472 5.8661 5.4499 3.4618 4.1741 2.7729 2.0162 5.9228 5.1056 4.4779 7.2289 3.4082 5.1946 5.9147 5.2835 4.3449 1.1935 4.1318 3.0882 5.0236 4.9741 7.2983 4.0885 5.2077 4.9495 3.6376 3.9715 2.8681 4.9944 2.9098 4.8875 4.2123 5.3506 1.9338 1.6754 2.9243 3.8935 1.6531 5.0946 5.9006 4.7094 3.7806 5.4047 4.9157 5.7685 5.2402 3.1622 3.7235 1.8643 7.4539 6.1850 6.1520 2.6312 2.0702 1.9270 5.5277 5.0125 1.9204 4.2181 5.5303 5.4277 3.0923 3.5036 1.9700 2.8786 1.5138 4.1481 1.7449 3.2459 3.9540 1.4018 3.5088 5.1838 3.9111 1.7667 3.4087 1.4808 2.0899 1.9162 3.0022 1.9447 1.5510 2.2763 5.4183 2.1710 1.3606 2.1865 1.9458 3.4688 3.2356 1.1504 1.5421 2.2056 1.1912 1.9184 2.2343 1.7105 1.7415 1.2481 1.7455 2.3288 1.4885 1.8031 2.3240 1.6511 1.2609 1.5202 2.2433 1.6271 1.3720 1.3025 3.7210 2.3972 2.7246 2.2681 1.4707 7.5311 1.4976 3.3588 1.2048 1.7942 3.1000 1.2121 6.0450 2.5769 1.2019 2.3271 1.0957 1.0937 1.0818 3.5617 3.0647 2.7971 8.3030 3.2578 6.3799 6.3042 5.7938 6.7652 8.2184 6.7191 1.4830 1.0995 1.0559 1.0850 1.0377 1.0611 1.0972 1.0992 1.0734 1.0963 1.0787 1.0986 1.0910 1.0995 1.0858 1.1030 1.0890 1.0943 1.1001 1.0931 1.0980 1.0791 1.0750 1.0655 1.0671
irintensity: 0.4563 0.2719 3.9316 0.1172 0.5175 1.4251 3.3510 8.8547 2.7592 3.7736 1.3062 5.6634 4.9749 1.1240 2.6158 4.3912 0.5196 3.8044 2.6563 3.2929 12.7555 9.3441 3.0850 5.6759 112.2468 2.3533 10.0557 1.1731 4.8450 7.2377 14.7016 2.5926 3.9545 5.0994 8.5226 3.4904 1.1176 12.5793 8.1963 13.7193 1.1032 65.6558 85.9573 13.4837 4.8069 15.9194 3.0891 0.2619 0.2581 0.2756 2.9629 16.8206 12.9529 16.1639 53.7091 21.2506 54.6287 34.0814 32.6250 6.5334 14.7440 18.6251 27.5823 22.5294 16.4468 59.9375 1.1055 2.1638 21.3970 8.3940 1.8434 16.5902 31.5636 2.6206 7.8458 7.1357 157.2060 1.8428 2.2602 23.7665 13.4589 66.8870 27.2565 19.4722 5.0159 95.9629 5.5022 45.6748 31.3401 0.3968 18.6787 65.0844 13.6691 75.2530 45.5951 28.6881 105.8942 6.6530 0.2150 13.2085 21.5455 1.6353 15.7110 8.0271 46.7005 7.0157 14.2033 87.4490 94.6274 13.8478 64.3375 35.8116 8.9585 3.7950 3.5156 39.2540 24.9816 32.2392 20.1989 100.6874 77.0238 97.8995 88.8025 14.3262 150.4205 3.5130 85.5114 56.7034 18.3722 1.7168 21.0729 141.7076 92.3542 64.1742 35.9934 29.1601 37.0283 4.7658 59.0132 815.0887 19.6903 285.3782 271.3315 77.5545 71.7535 328.5130 17.1918 330.6625 188.0140 129.2878 1488.3107 47.5741 34.5879 17.4268 13.6860 13.0411 6.1550 5.5777 50.7112 30.9138 11.2104 19.1617 7.5802 10.1880 9.0004 0.7950 34.5714 47.9409 13.1214 0.7705 165.1993 36.5413 37.6076 17.1314
temp: 298.150 k
press: 1.00000 atm
elementType: 8 8 8 8 8 7 7 7 7 7 7 6 6 6 6 6 6 6 6 6 6 6 6 6 6 6 6 6 6 6 6 6 6 6 6 6 1 1 1 1 1 1 1 1 1 1 1 1 1 1 1 1 1 1 1 1 1 1 1 1
symmnumber: 1
zpe: 1213136.3 jmol-1
zpe.correction: 0.462059 hartree
zpe.thermalcorrener: 0.493349 hartree
zpe.thermalcorrenthalpy: 0.494294 hartree
zpe.thermalcorrgfe: 0.395384 hartree
zpe.sumelectzpe: -1669.148975 hartree
zpe.sumelectthermal: -1669.117684 hartree
zpe.sumelectthermalent: -1669.116740 hartree
zpe.sumelectthermalfe: -1669.215650 hartree
dipole: 5.5558 -12.0219 -2.1132
dipole: 13.4112
quadrupole: -207.2819 -239.6662 -201.1308
quadrupole: -1.4909 -8.0439 -15.5080
quadrupole: 8.7444 -23.6399 14.8955 -1.4909 -8.0439 -15.5080
hfenergy: -1669.6110338 hartree
pointgroup: C01 [X(C25H24N6O5)]
dipole: 2.8853727 3.1634583 3.0833653 debye
polarizability: 479.9662496|-82.4732181|366.5706125|-2.271099|128.8806944|273.0779536 unknown
InChI: InChI=1S/C25H24N6O5/c1-12(33)27-17-7-14-6-13-4-2-3-5-15(13)16(14)8-18(17)28-25-29-23-22(24(35)30-25)26-11-31(23)21-9-19(34)20(10-32)36-21/h2-5,7-8,11,19-21,27-29,32,34H,6,9-10H2,1H3
charge 0 multiplicity 1
60 atoms
O  4.186629 -0.092471 1.653474
O  7.591224 1.070556 0.988982
O  5.504659 2.872826 -0.141686
O  1.346016 -3.510188 -3.050326
O  -4.157344 -3.354644 -2.168099
N  4.376857 -1.992438 0.200179
N  1.98091 -1.349403 0.455697
N  4.187879 -3.232666 -1.720659
N  -0.324436 -0.939039 0.551497
N  0.546814 -2.236186 -1.254614
N  -2.125437 -2.445838 -1.370459
C  4.893024 -1.384651 1.453098
C  6.378141 0.33766 0.678672
C  6.384214 -1.029433 1.390769
C  5.105649 1.018375 1.251733
C  4.42506 1.940201 0.237603
C  3.038998 -1.983814 -0.17513
C  5.032659 -2.782705 -0.78611
C  2.92164 -2.73566 -1.353913
C  -4.383813 0.233318 -0.030607
C  -3.496053 0.964243 0.812105
C  -5.773035 0.857866 0.016418
C  -4.232835 2.076617 1.434828
C  -5.587208 2.029557 0.975921
C  0.714679 -1.532154 -0.1426
C  -1.689705 -0.587437 0.212453
C  -2.157462 0.552558 0.918904
C  1.603488 -2.88109 -1.989401
C  -3.94013 -0.879446 -0.748703
C  -2.583344 -1.324123 -0.647705
C  -3.817702 3.079965 2.339173
C  -6.521827 2.981195 1.418484
C  -4.762836 4.034795 2.781941
C  -6.104219 3.987853 2.326685
C  -2.88769 -3.371915 -2.088003
C  -2.057229 -4.457249 -2.766217
H  4.611607 -2.021973 2.308835
H  6.263765 0.204084 -0.417587
H  7.006432 -1.779386 0.880402
H  6.77085 -0.895147 2.415439
H  5.376795 1.580468 2.164633
H  3.571021 2.480599 0.691357
H  4.072971 1.355144 -0.636792
H  6.09949 -2.984575 -0.756037
H  7.503092 1.962912 0.559801
H  2.190091 -0.641038 1.168858
H  -6.533924 0.139588 0.379481
H  -6.109931 1.190389 -0.984862
H  5.169652 3.556014 -0.771654
H  -1.456793 1.110232 1.555045
H  -4.60786 -1.465427 -1.384039
H  -0.063298 -0.573323 1.470562
H  -2.782358 3.124361 2.697482
H  -7.561058 2.950422 1.07095
H  -4.457246 4.818854 3.484148
H  -6.823364 4.73524 2.680274
H  -1.067309 -2.523584 -1.448716
H  -1.022765 -4.143158 -2.989877
H  -2.563756 -4.755703 -3.697845
H  -2.015136 -5.348329 -2.111344
