program: Gaussian 09
title: 000182279
version: EM64L-G09RevD.01
frameworkgroup: C1[X(C16H22O9)]
method: RPBEPBE
basis: SDD
operation: Freq
keyword: #pfreq=noraman
keyword: PBEPBE/SDD
title: #p freq=noraman PBEPBE/SDD
converged: YES YES NO NO
title: Mulliken charges:
elementType: O O O O O O O O O C C C C C C C C C C C C C C C C H H H H H H H H H H H H H H H H H H H H H H
charge: -0.272158 -0.294894 -0.241017 -0.455278 -0.469832 -0.428510 -0.472799 -0.429707 -0.217300 -0.385208 -0.213488 0.023560 -0.493243 0.412161 -0.139619 -0.139105 -0.062649 -0.405908 -0.203775 0.317961 -0.081290 -0.502001 -0.272947 -0.334898 -0.242088 0.321687 0.284318 0.243374 0.218372 0.260714 0.300066 0.287551 0.233562 0.273057 0.248170 0.232528 0.186494 0.241179 0.252123 0.192148 0.239325 0.156455 0.369262 0.371978 0.336783 0.400822 0.354063
chargesum: 0.00000
title: Mulliken charges with hydrogens summed into heavy atoms:
elementType: O O O O O O O O O C C C C C C C C C C C C C C C C
charge: -0.272158 -0.294894 -0.241017 -0.086015 -0.097854 -0.091727 -0.071976 -0.075644 -0.217300 -0.063521 0.070829 0.266934 -0.014157 0.412161 0.160447 0.148446 0.170914 -0.157738 0.069282 0.317961 0.151238 -0.074328 -0.020824 0.096575 -0.085633
polarizability: 2.50925524e+02 3.29506072e+00 1.80932515e+02 -1.36886374e+01 1.38118602e+01 1.67347558e+02
1716.lowfreq: -6.6423 -6.1181 -2.9419 -0.0006 -0.0005 -0.0004 16.0174 28.0758 41.4349
frequency: 15.3183 27.8616 41.3587 52.7911 70.5000 85.0189 94.8451 99.8489 112.3165 141.7904 144.3842 159.5323 163.4507 170.7777 178.9892 190.7986 213.4545 231.6804 236.6357 256.8013 284.7068 310.6502 317.9755 321.8243 342.2930 365.0343 371.5996 381.1167 407.8607 421.3383 437.3973 442.0456 452.2927 468.2035 483.8192 493.6008 508.6280 518.6614 542.2062 574.7815 591.7897 603.0607 624.8521 646.2529 655.0496 739.0578 762.5423 798.1344 810.2946 822.5952 840.2288 870.4676 877.8646 905.5673 920.7495 937.2454 949.4833 955.1665 958.3353 967.4457 972.8156 987.6912 992.1480 1000.5598 1007.1070 1008.0988 1014.0198 1033.7461 1051.2447 1071.7668 1077.3878 1095.9451 1104.1330 1121.5714 1133.9258 1145.2664 1166.4667 1168.1425 1182.9460 1195.1803 1198.0242 1216.1896 1224.9596 1227.5756 1230.9390 1247.7485 1262.6826 1274.0849 1283.7445 1293.1993 1302.3270 1302.5171 1305.6455 1316.5385 1325.8682 1332.4675 1339.4291 1344.3223 1346.8784 1362.3579 1368.1251 1369.7048 1372.1320 1374.5830 1381.7839 1392.1901 1399.5206 1457.5063 1460.9804 1475.9278 1590.5623 1618.1357 1645.1045 2858.6503 2915.7164 2951.3551 2970.2698 2971.5697 2974.9230 2983.9897 3005.2070 3038.3119 3050.0951 3065.4841 3083.7621 3087.3626 3092.7323 3098.3132 3144.4093 3150.0748 3396.7547 3526.9557 3531.7384 3543.8450 3565.5543
redmass: 6.3835 5.7107 6.2087 7.8093 5.4841 6.1890 5.9553 4.4614 6.4032 6.4308 5.5741 4.4432 5.9985 4.9329 3.7047 4.5693 3.2144 4.5542 3.8567 3.7385 2.9240 3.2891 1.2599 1.4454 2.8329 3.2740 1.9330 1.7728 4.1021 3.9766 3.9359 3.6638 3.1908 1.5051 4.1995 5.1638 3.8807 4.7882 3.8973 4.3833 4.1659 6.1242 3.7221 1.1869 4.4470 3.6059 3.8389 4.3628 1.3634 5.8320 3.6900 1.4412 3.2895 3.9754 3.4244 4.1807 2.2485 3.0525 4.0334 1.9584 2.1386 2.4574 2.4553 3.1765 3.0564 3.4174 3.4100 3.0402 2.9511 3.8731 4.0537 1.9288 2.8099 2.0431 1.6160 4.8824 1.1797 1.8955 1.2588 1.0954 1.3222 1.6035 1.3165 1.4564 1.2785 1.4324 1.3979 1.3663 1.3765 2.1289 1.2676 1.3392 1.3577 1.2736 1.1996 1.2036 1.3143 1.3544 1.3690 1.3063 1.3174 1.3163 2.0326 1.6062 1.3017 1.5418 1.1482 1.0732 1.0842 1.0896 7.3180 6.2846 7.4282 1.0844 1.0690 1.0714 1.0693 1.0839 1.0833 1.0850 1.0828 1.0903 1.0849 1.0940 1.0843 1.0865 1.0884 1.0937 1.0957 1.0931 1.0679 1.0660 1.0660 1.0655 1.0659
irintensity: 0.5303 0.3150 0.0263 2.9161 2.6158 2.7187 8.0144 5.7049 4.2647 3.9269 7.1651 3.5306 4.0933 9.6118 0.6658 15.5326 7.9635 8.5727 3.9280 14.0467 45.1332 9.3707 56.6596 58.3392 32.7478 1.1254 189.2158 146.3394 4.8356 28.1286 17.8782 0.0699 11.5126 120.3473 6.1583 17.1422 4.3124 12.2052 13.7241 37.7590 9.7060 3.7647 4.2122 115.9963 6.6424 48.7972 120.9300 55.1390 14.0932 84.8077 39.6260 16.2962 164.8086 17.5242 55.6736 30.4079 74.0617 108.4422 140.8808 28.4755 33.4608 39.3408 17.7040 96.0565 7.7835 67.1541 8.3953 141.0056 60.1808 310.5169 32.0101 38.5341 9.2291 21.2024 10.7952 88.9293 11.5856 12.8371 10.0715 27.0801 50.1628 73.2553 44.5159 16.7428 9.2502 7.9776 20.3305 23.0345 9.0672 0.3141 3.8677 4.0828 11.7171 1.0417 3.8397 9.4540 11.4178 16.4847 2.4727 4.3935 12.0164 9.2836 1.5303 17.5582 35.4983 45.8240 33.6961 3.9585 4.5923 9.6152 144.8959 256.8918 2.2353 141.5521 70.3174 27.0981 20.6647 4.0640 96.8238 25.7040 6.5569 31.0327 7.1957 12.1718 3.2950 11.1654 8.3633 17.7276 16.5557 9.0685 252.0875 11.8774 7.8694 8.6567 22.8271
temp: 298.150 k
press: 1.00000 atm
elementType: 8 8 8 8 8 8 8 8 8 6 6 6 6 6 6 6 6 6 6 6 6 6 6 6 6 1 1 1 1 1 1 1 1 1 1 1 1 1 1 1 1 1 1 1 1 1 1
symmnumber: 1
zpe: 972273.1 jmol-1
zpe.correction: 0.370319 hartree
zpe.thermalcorrener: 0.395225 hartree
zpe.thermalcorrenthalpy: 0.396170 hartree
zpe.thermalcorrgfe: 0.315331 hartree
zpe.sumelectzpe: -1297.878061 hartree
zpe.sumelectthermal: -1297.853155 hartree
zpe.sumelectthermalent: -1297.852211 hartree
zpe.sumelectthermalfe: -1297.933049 hartree
dipole: 4.5938 -1.9161 0.4606
dipole: 4.9987
quadrupole: -162.5119 -150.9782 -159.9872
quadrupole: 9.6345 2.4086 12.2807
quadrupole: -4.6861 6.8476 -2.1615 9.6345 2.4086 12.2807
hfenergy: -1298.2483804 hartree
pointgroup: C01 [X(C16H22O9)]
dipole: -1.7734602 0.1525442 0.8362067 debye
polarizability: 251.4779863|-10.5731925|180.2161374|5.2105122|14.6012844|167.5114735 unknown
InChI: InChI=1S/C16H22O9/c17-3-7-1-2-9-8(4-18)6-23-15(11(7)9)25-16-14(22)13(21)12(20)10(5-19)24-16/h1,4,6,9-17,19-22H,2-3,5H2
charge 0 multiplicity 1
47 atoms
O  -0.488145 0.845853 -0.224963
O  -1.823869 0.567655 1.812238
O  1.381011 1.751019 0.899372
O  -3.577723 2.584122 0.797861
O  -2.833915 0.624349 -2.163202
O  -4.079018 -1.642942 -0.352318
O  -0.313242 -0.378881 -3.110757
O  -2.23265 -1.553506 3.609381
O  5.938875 0.176935 0.438059
C  1.681051 0.054139 -0.944115
C  3.159419 -0.16568 -0.485233
C  0.824253 0.509348 0.249008
C  3.244929 -1.685064 -0.111487
C  1.273357 -1.335827 -1.443224
C  -1.406112 1.463568 0.728735
C  -2.626199 1.903548 -0.09075
C  -3.312995 0.691737 -0.773132
C  2.138181 -2.277775 -0.972929
C  -3.040168 -0.645439 -0.045992
C  3.615871 0.8281 0.560119
C  -2.858565 -0.481941 1.476951
C  0.072728 -1.563008 -2.350646
C  2.745708 1.730252 1.122747
C  -2.369989 -1.760756 2.169454
C  5.034568 0.920541 0.920704
H  1.586572 0.821956 -1.73152
H  3.804283 -0.02936 -1.374889
H  0.779349 -0.248325 1.05867
H  3.060621 -1.855663 0.969477
H  4.244295 -2.097008 -0.331425
H  -0.910546 2.298624 1.248887
H  -2.333868 2.626626 -0.867541
H  -4.40279 0.906696 -0.755675
H  -2.122647 -1.0837 -0.469103
H  2.067483 -3.350403 -1.186361
H  -3.804443 -0.147971 1.954422
H  -0.788207 -1.956836 -1.763521
H  0.327131 -2.337618 -3.096092
H  3.054467 2.535751 1.798188
H  -1.40942 -2.078645 1.708663
H  -3.109457 -2.56784 2.04713
H  5.285886 1.710425 1.675371
H  -3.439169 2.260649 1.727005
H  -3.338506 -0.077886 -2.647904
H  -4.955969 -1.318125 -0.018445
H  -0.971919 0.164285 -2.590015
H  -1.632809 -0.774283 3.743199
