program: Gaussian 09
title: 000182268
version: EM64L-G09RevD.01
frameworkgroup: C1[X(C23H25NO6)]
method: RPBEPBE
basis: SDD
operation: Freq
keyword: #p
keyword: freq=noraman
keyword: PBEPBE/SDD
title: #p freq=noraman PBEPBE/SDD
converged: YES YES NO NO
title: Mulliken charges:
elementType: O O O O O O N C C C C C C C C C C C C C C C C C C C C C C C H H H H H H H H H H H H H H H H H H H H H H H H H
charge: -0.274728 -0.250318 -0.261606 -0.281074 -0.284146 -0.233885 -0.140971 0.223265 -0.269490 -0.681516 0.278517 0.217312 0.370373 -0.440869 0.338712 -0.537616 -0.009427 -0.646561 -0.505760 -0.436160 -0.566885 0.147365 -0.350728 0.166276 0.176363 0.335290 -0.205199 -0.782066 -0.543947 -0.520808 0.303737 0.235705 0.267780 0.197546 0.212780 0.208613 0.243507 0.194692 0.244579 0.227889 0.261508 0.247929 0.260025 0.250156 0.241985 0.232281 0.247185 0.241816 0.261308 0.221188 0.241830 0.232551 0.208089 0.227917 0.257690
chargesum: 0.00000
title: Mulliken charges with hydrogens summed into heavy atoms:
elementType: O O O O O O N C C C C C C C C C C C C C C C C C C C C C C C
charge: -0.274728 -0.250318 -0.261606 -0.281074 -0.284146 -0.233885 -0.140971 0.223265 0.034246 -0.178031 0.278517 0.217312 0.370373 -0.030542 0.338712 -0.085496 -0.009427 0.020598 -0.244252 -0.188231 -0.306859 0.147365 -0.100571 0.166276 0.176363 0.335290 0.269067 -0.031756 0.151622 0.172889
polarizability: 3.44478811e+02 -7.25816444e+00 2.57694615e+02 -7.51532098e+00 3.27960749e+00 2.31186028e+02
1716.lowfreq: -7.9851 0.0005 0.0007 0.0009 3.1104 9.7348 18.7516 20.4610 36.3814
frequency: 18.4106 20.1567 36.3713 41.7123 58.2180 58.8640 62.1567 77.7362 84.4765 88.7774 105.1990 118.4506 124.8651 138.3641 161.8182 174.2255 178.7507 185.3210 197.7482 217.0352 234.9672 242.1119 254.2184 263.6816 276.3653 285.1681 302.9101 316.1817 324.1442 337.8535 349.9927 357.9071 407.4854 440.0809 443.9465 456.7511 476.3045 482.8531 490.5891 501.1451 530.6918 548.5018 561.5392 566.3364 593.5519 611.0321 615.6018 622.7035 668.9854 682.7086 702.0331 715.0991 723.6277 729.6291 745.2435 763.3028 789.1549 790.5359 810.9634 833.5437 864.1927 874.1631 877.6921 891.5989 899.7228 927.4358 931.3381 941.3220 966.8124 971.8307 977.0214 984.1524 989.1313 995.9469 1001.7708 1031.2229 1041.4488 1047.5936 1070.7143 1072.3283 1094.8135 1111.6815 1112.2967 1112.4500 1121.1764 1130.3010 1133.9293 1150.2160 1154.4086 1165.0177 1178.5217 1186.3213 1189.3748 1198.3059 1205.0728 1217.4573 1241.8839 1249.7953 1252.1967 1265.6704 1279.0147 1282.0919 1283.2510 1324.9455 1347.3254 1364.3778 1366.3172 1379.4997 1380.8374 1395.2276 1406.9145 1430.9131 1437.4074 1443.0845 1444.1872 1445.6008 1451.9104 1454.3839 1454.9098 1455.0619 1464.0241 1465.3712 1474.0421 1476.3317 1477.3212 1481.0431 1483.0063 1491.9848 1507.2671 1577.9849 1607.9396 1618.3305 1647.2135 1658.3229 2852.3502 2876.1596 2959.7645 2972.0701 2981.2888 2994.7330 2997.0047 3000.4028 3024.9658 3033.4873 3036.4546 3039.7519 3042.8177 3047.2089 3080.6154 3085.1195 3092.9685 3111.4036 3120.7353 3124.3548 3138.7963 3142.4811 3144.7000 3163.4158 3180.5021
redmass: 6.9955 6.2852 4.6045 3.8847 2.8615 3.0173 3.0579 2.6982 1.4508 1.8800 3.1293 4.6565 3.1771 2.0029 2.0421 4.8263 3.1628 3.1104 2.3135 3.3432 2.8982 1.6533 2.8993 3.6271 3.5814 3.0015 5.2340 3.9113 3.7254 3.9717 2.7282 4.1407 3.9849 4.1860 5.1541 3.7607 3.4363 5.7038 3.5448 4.0161 3.9753 3.6143 4.3190 3.6726 5.4094 5.8621 5.3195 4.0951 6.0691 6.4860 5.2397 5.8521 5.8674 4.2740 4.1084 5.6559 3.9813 2.8444 1.5294 8.3464 2.2278 1.6606 4.6835 1.6157 3.2436 4.5179 1.4195 5.9871 2.5582 4.3679 4.9236 3.8116 2.7087 2.5433 2.7724 5.2502 1.6562 2.0788 1.5502 2.0717 3.9778 1.2585 1.2477 1.3261 1.4831 1.0826 2.0814 1.3705 1.4049 1.5920 2.1026 1.9258 2.9114 1.5219 2.0269 1.5382 2.4267 2.4847 2.7713 1.6665 2.9941 1.7135 2.0924 1.7583 1.2368 1.3118 1.4156 1.2790 6.8871 2.8004 5.4155 1.2408 1.1749 1.2868 1.2853 2.0471 1.2140 1.0767 1.0609 1.0637 2.1899 1.0507 1.2717 1.0998 1.0901 1.0534 1.2231 1.0615 2.7357 9.0966 8.5784 6.8396 10.0000 9.6540 1.0697 1.0585 1.0327 1.0350 1.0600 1.0620 1.0604 1.0381 1.0739 1.0875 1.0844 1.1016 1.1011 1.1038 1.0966 1.0990 1.0953 1.1090 1.0998 1.1045 1.1013 1.0899 1.0914 1.0897 1.0954
irintensity: 0.1750 0.0203 1.0714 1.5034 0.9825 2.7129 3.0243 4.9259 3.2597 5.6254 12.2876 1.8961 0.3814 1.3779 1.5082 0.7814 0.4732 1.2568 3.2742 1.1844 3.4607 0.8986 2.6196 1.2757 0.5640 1.7246 0.4055 4.4897 10.5800 4.6907 0.0520 1.4458 2.7841 14.3760 5.0971 2.0815 5.0370 1.5555 4.8234 4.9696 3.4836 2.9516 2.1836 4.6091 7.7016 3.5617 4.9421 1.4078 2.2785 4.4291 7.6569 7.5182 18.3474 8.3773 5.9702 7.9944 4.1305 6.1167 51.2000 30.2891 10.4886 7.2454 16.6979 25.5168 10.1358 14.9842 4.7156 101.5784 4.2825 26.1398 84.6099 72.2666 95.8194 41.5783 13.3718 32.3216 14.0180 13.8696 13.9502 8.0109 38.5219 1.6005 4.9827 9.0028 0.8482 0.8323 58.3247 0.7082 13.6174 30.8338 47.0457 90.0605 187.2005 17.3382 19.5878 45.7069 101.9745 61.9095 5.5308 32.2887 122.4247 42.3669 13.0344 23.2910 10.4790 2.6837 15.4304 60.0132 0.9157 21.9381 10.7197 1.6571 15.6440 32.4409 71.2764 81.9405 37.3484 32.1342 4.7088 17.9158 1.7497 13.5197 11.8807 65.4965 16.4164 25.5208 5.2535 14.3971 155.7953 9.6315 2.2367 11.5162 1.7204 162.4601 72.7576 136.1644 53.3110 101.1239 28.9581 133.3691 14.9683 2.9674 30.4090 62.8235 14.5294 28.4815 11.9733 42.7814 38.8414 35.2323 7.5313 26.9926 25.8000 20.3715 9.6373 7.9693 8.5785 4.1529 7.2137
temp: 298.150 k
press: 1.00000 atm
elementType: 8 8 8 8 8 8 7 6 6 6 6 6 6 6 6 6 6 6 6 6 6 6 6 6 6 6 6 6 6 6 1 1 1 1 1 1 1 1 1 1 1 1 1 1 1 1 1 1 1 1 1 1 1 1 1
symmnumber: 1
zpe: 1144392.1 jmol-1
zpe.correction: 0.435876 hartree
zpe.thermalcorrener: 0.464418 hartree
zpe.thermalcorrenthalpy: 0.465362 hartree
zpe.thermalcorrgfe: 0.375454 hartree
zpe.sumelectzpe: -1395.272444 hartree
zpe.sumelectthermal: -1395.243902 hartree
zpe.sumelectthermalent: -1395.242958 hartree
zpe.sumelectthermalfe: -1395.332866 hartree
dipole: 1.7476 -0.7586 -3.6988
dipole: 4.1606
quadrupole: -170.5233 -156.2928 -176.7652
quadrupole: 1.4149 11.9357 -2.4985
quadrupole: -2.6628 11.5676 -8.9048 1.4149 11.9357 -2.4985
hfenergy: -1395.7083196 hartree
pointgroup: C01 [X(C23H25N1O6)]
dipole: -0.840998 0.8873407 -1.0884985 debye
polarizability: 345.5254292|2.6538141|252.8174508|-1.1713137|10.1211134|235.0165735 unknown
InChI: InChI=1S/C23H25NO6/c1-13(25)30-22-20-15(5-6-17-21(20)29-12-28-17)11-23(22)16-10-19(27-4)18(26-3)9-14(16)7-8-24(23)2/h5-6,9-10,22H,7-8,11-12H2,1-4H3
charge 0 multiplicity 1
55 atoms
O  -0.37293 0.18427 1.49988
O  -3.748538 -0.263537 1.847868
O  -5.590238 0.554052 0.545831
O  3.108445 2.856118 0.267034
O  5.40956 1.143585 0.280682
O  0.405581 -1.506704 2.920259
N  0.199593 -2.57587 -0.898098
C  0.147699 -1.089431 -0.715663
C  -0.843139 -0.841941 0.524649
C  -0.558949 -0.350271 -1.935199
C  1.557308 -0.515973 -0.481247
C  -2.116847 -0.335237 -0.090421
C  -1.980564 -0.068588 -1.484239
C  1.387081 -3.085579 -1.613809
C  2.726098 -1.317674 -0.478929
C  2.637473 -2.803144 -0.769511
C  -3.363847 -0.10985 0.492458
C  -1.057024 -3.228834 -1.31024
C  1.691864 0.882835 -0.271855
C  -3.064373 0.404276 -2.25265
C  3.982445 -0.705623 -0.256148
C  -4.446077 0.366498 -0.278557
C  -4.332821 0.635357 -1.646004
C  2.940811 1.484376 -0.022257
C  4.11888 0.674877 -0.021143
C  0.265123 -0.293734 2.659776
C  -5.223923 -0.056568 1.848669
C  0.740915 0.868236 3.502641
C  1.904266 3.689818 0.288693
C  5.899627 2.337962 -0.43719
H  -0.927644 -1.79092 1.084655
H  -0.514296 -0.982706 -2.841783
H  -0.030108 0.587391 -2.184001
H  1.507277 -2.641502 -2.634917
H  1.254755 -4.175031 -1.746006
H  3.548535 -3.146898 -1.295373
H  2.556291 -3.376262 0.174429
H  -1.380393 -2.997221 -2.354747
H  -1.885445 -2.947283 -0.639274
H  -0.92562 -4.323135 -1.235906
H  0.789307 1.49909 -0.253277
H  -2.940423 0.597848 -3.323294
H  4.898911 -1.305511 -0.262963
H  -5.186105 1.007353 -2.218842
H  -5.486262 0.639262 2.65969
H  -5.722131 -1.0406 1.942311
H  1.001787 0.512984 4.510275
H  -0.033192 1.650902 3.559467
H  1.640973 1.309968 3.036403
H  1.411205 3.714899 -0.702791
H  2.25798 4.697625 0.552733
H  1.181564 3.335068 1.048857
H  5.892206 2.161473 -1.530684
H  6.935348 2.469947 -0.088234
H  5.290081 3.223561 -0.196012
