program: Gaussian 09
title: 000182259
version: EM64L-G09RevD.01
frameworkgroup: C1[X(C16H16O4)]
method: RPBEPBE
basis: SDD
operation: Freq
keyword: #pfreq=noraman
keyword: PBEPBE/SDD
title: #p freq=noraman PBEPBE/SDD
converged: YES YES NO NO
title: Mulliken charges:
elementType: O O O O C C C C C C C C C C C C C C C C H H H H H H H H H H H H H H H H
charge: -0.253865 -0.442158 -0.267918 -0.437511 -0.270589 -0.571583 -0.352058 0.373243 0.397838 0.192248 0.111188 -0.383390 -0.377940 -0.521366 -0.428904 -0.546789 0.326491 -0.413147 0.357767 -0.535990 0.303799 0.221530 0.240485 0.203618 0.240631 0.229561 0.228976 0.271982 0.216991 0.243620 0.241051 0.361617 0.350699 0.222068 0.222302 0.245503
chargesum: 0.00000
title: Mulliken charges with hydrogens summed into heavy atoms:
elementType: O O O O C C C C C C C C C C C C C C C C
charge: -0.253865 -0.080541 -0.267918 -0.086811 0.033210 -0.109568 0.092191 0.373243 0.397838 0.192248 0.111188 -0.153829 -0.148964 -0.249384 -0.211913 -0.303169 0.326491 -0.172096 0.357767 0.153883
polarizability: 2.99994546e+02 -5.08641805e+00 1.48426557e+02 6.82756388e+00 3.59753056e+00 1.31060817e+02
1716.lowfreq: -2.6262 0.0003 0.0005 0.0008 6.0045 13.5752 24.5508 34.7366 42.2355
frequency: 23.9466 34.6990 41.9349 92.4015 114.2646 120.3244 151.7163 177.7049 214.4815 219.8916 234.7939 237.1678 261.0876 279.8968 328.3170 335.8987 347.8344 357.1054 388.8133 422.3142 440.8194 452.1401 455.3472 474.8273 495.3045 535.3287 555.3541 559.4289 602.6764 610.4766 620.8107 700.7618 709.5130 715.5951 727.1641 756.9318 773.7546 794.5362 834.3123 845.6743 862.5298 878.5263 903.0914 905.0480 917.0277 924.8750 931.2910 994.7628 1008.3465 1051.0915 1082.4840 1095.1279 1107.2747 1112.5685 1139.5098 1143.2910 1151.6526 1172.8971 1178.0771 1184.4763 1201.1131 1203.9232 1237.6441 1258.8308 1265.4783 1273.3563 1279.3991 1301.9997 1326.9429 1352.5209 1373.0610 1394.3674 1400.1086 1421.9294 1437.3690 1437.8554 1460.1321 1465.6865 1467.7945 1473.3303 1498.1211 1510.4540 1590.4998 1596.5508 1625.8338 1637.0360 2961.1306 2963.9320 2974.0018 3028.7745 3048.4985 3049.3490 3095.2243 3112.3952 3125.5821 3129.9456 3135.8840 3139.4320 3171.0340 3184.1988 3585.4290 3588.7070
redmass: 4.6295 5.5315 4.6714 3.7715 4.1283 3.1879 3.5298 5.5434 4.3776 1.7208 2.5426 4.0129 3.8229 4.2096 2.9351 1.1846 1.1993 3.9556 4.2048 4.3729 3.0550 3.1519 3.6784 3.8885 5.4780 6.2054 4.9401 5.3652 4.1401 4.2075 3.6103 3.2426 6.3253 6.3821 3.3965 3.8139 1.4341 1.4726 1.7753 2.9381 1.5665 2.0073 3.3715 4.0409 3.2449 1.3972 1.3928 4.0040 3.6110 2.2411 2.5549 2.7602 2.3507 1.2594 1.3791 1.4912 1.2400 1.4946 1.6457 1.3848 1.6609 1.7486 1.4005 1.6233 2.5801 3.2412 1.4572 1.5706 1.3782 1.3470 1.5400 6.1191 4.1013 3.4768 1.3078 1.9597 1.2520 1.0502 1.1489 1.0678 3.1333 2.7882 7.3011 7.2260 6.8980 6.9181 1.0329 1.0642 1.0668 1.0917 1.0879 1.1040 1.0988 1.0868 1.0992 1.0886 1.0970 1.0919 1.0937 1.0925 1.0660 1.0660
irintensity: 0.5675 0.1452 0.8093 4.7065 2.2236 0.7938 1.5768 2.8689 5.5320 0.2898 1.3235 3.5988 4.0480 3.1608 0.4444 142.9604 126.8125 1.6346 13.2824 7.7978 1.3353 8.5344 6.2187 10.6864 4.7558 2.0827 12.6917 18.3206 10.6492 12.9937 6.4161 1.2988 6.1207 3.4985 0.5595 6.6734 39.1262 19.4495 55.5133 14.3738 33.7171 2.1532 15.7474 9.9499 6.8080 7.3781 0.4058 160.9491 49.8289 15.5544 167.3683 303.4597 56.1209 0.1858 57.8476 40.3428 34.1739 65.2368 62.7466 28.7694 33.3451 7.6837 4.2692 4.9874 22.3333 56.3930 31.6023 40.2931 20.2968 1.9564 27.7426 61.7227 15.0929 25.3474 4.9307 75.2606 25.1227 13.7894 14.6537 55.9086 81.0404 140.5148 40.9967 34.1890 125.1119 156.6756 66.3506 25.7590 63.1174 10.6375 16.6030 48.4876 18.6109 13.8445 33.0295 16.1800 21.6955 4.2982 9.5661 0.4663 40.9022 33.7453
temp: 298.150 k
press: 1.00000 atm
elementType: 8 8 8 8 6 6 6 6 6 6 6 6 6 6 6 6 6 6 6 6 1 1 1 1 1 1 1 1 1 1 1 1 1 1 1 1
symmnumber: 1
zpe: 745118.9 jmol-1
zpe.correction: 0.283801 hartree
zpe.thermalcorrener: 0.301751 hartree
zpe.thermalcorrenthalpy: 0.302695 hartree
zpe.thermalcorrgfe: 0.237350 hartree
zpe.sumelectzpe: -918.724654 hartree
zpe.sumelectthermal: -918.706704 hartree
zpe.sumelectthermalent: -918.705759 hartree
zpe.sumelectthermalfe: -918.771105 hartree
dipole: 3.8066 -2.6246 -1.6138
dipole: 4.8973
quadrupole: -100.2662 -108.2942 -115.9943
quadrupole: 4.8586 13.6823 -3.7805
quadrupole: 7.9187 -0.1093 -7.8094 4.8586 13.6823 -3.7805
hfenergy: -919.0084547 hartree
pointgroup: C01 [X(C16H16O4)]
dipole: 1.4887033 1.0604639 0.6095284 debye
polarizability: 299.6602805|7.2405326|148.6738142|-8.6329341|3.2498329|131.1478263 unknown
InChI: InChI=1S/C16H16O4/c1-19-13-4-5-14(15(18)8-13)11-6-10-2-3-12(17)7-16(10)20-9-11/h2-5,7-8,11,17-18H,6,9H2,1H3
charge 0 multiplicity 1
36 atoms
O  -1.939459 -1.007294 -1.453826
O  1.823444 -2.310916 1.14809
O  5.744237 0.295109 0.058214
O  -6.452795 -0.075022 -0.187902
C  0.007676 -0.431775 0.024829
C  -0.795565 0.729021 0.668586
C  -0.507755 -0.637655 -1.419685
C  -2.292285 0.54624 0.454063
C  1.511674 -0.197751 0.023583
C  -2.785339 -0.298624 -0.58114
C  2.403143 -1.156245 0.58578
C  -3.245489 1.186988 1.27838
C  2.095464 0.955351 -0.548548
C  -4.168287 -0.498922 -0.780588
C  -4.633702 1.013198 1.097741
C  3.79882 -0.964152 0.584389
C  -5.085394 0.159279 0.059836
C  3.491494 1.177765 -0.57048
C  4.344703 0.20571 0.004859
C  6.365779 1.487288 -0.523419
H  -0.202269 -1.360884 0.583604
H  -0.4629 1.693148 0.231592
H  -0.568325 0.783607 1.749449
H  -0.368574 0.286048 -2.018841
H  0.005023 -1.4752 -1.918445
H  -2.889465 1.834972 2.088954
H  1.442314 1.716247 -0.99222
H  -4.51953 -1.15615 -1.579446
H  -5.348205 1.524475 1.754903
H  4.483967 -1.699897 1.021572
H  3.888951 2.088406 -1.026179
H  2.519123 -2.910401 1.514775
H  -7.010978 0.430482 0.453278
H  6.028062 2.408192 -0.009587
H  6.150038 1.566047 -1.606644
H  7.446303 1.351616 -0.369523
