program: Gaussian 09
title: 000182244
version: EM64L-G09RevD.01
frameworkgroup: C1[X(C21H28O7)]
method: RPBEPBE
basis: SDD
operation: Freq
keyword: #pfreq=noraman
keyword: PBEPBE/SDD
title: #p freq=noraman PBEPBE/SDD
converged: YES YES NO NO
title: Mulliken charges:
elementType: O O O O O O O C C C C C C C C C C C C C C C C C C C C C H H H H H H H H H H H H H H H H H H H H H H H H H H H H
charge: -0.242290 -0.432500 -0.226838 -0.456493 -0.215773 -0.287063 -0.206948 0.218633 0.256544 -0.331498 -0.071342 -0.106083 0.106217 -0.582323 -0.097770 0.081258 -0.837392 0.069732 -0.850563 -0.462128 -0.607626 0.247317 -0.174550 0.027482 -0.758161 0.196791 -0.802535 -0.514059 0.292955 0.249731 0.260554 0.219668 0.257475 0.230043 0.222151 0.248992 0.261628 0.206963 0.285978 0.225665 0.235239 0.223594 0.276421 0.275359 0.240181 0.227209 0.221936 0.221848 0.347602 0.259342 0.246734 0.238432 0.364672 0.229677 0.271014 0.218897
chargesum: 0.00000
title: Mulliken charges with hydrogens summed into heavy atoms:
elementType: O O O O O O O C C C C C C C C C C C C C C C C C C C C C
charge: -0.242290 -0.084899 -0.226838 -0.091821 -0.215773 -0.287063 -0.206948 0.218633 0.256544 -0.038543 0.178389 0.154472 0.106217 -0.105180 0.132273 0.081258 -0.104621 0.069732 -0.131957 -0.003295 -0.055846 0.247317 0.065630 0.027482 -0.087169 0.196791 -0.058027 0.205529
polarizability: 2.71767302e+02 -4.14884831e+00 2.52540749e+02 -7.96749354e+00 1.20514718e+00 2.00163051e+02
1716.lowfreq: -11.0212 -0.0010 -0.0007 -0.0002 7.9133 9.1079 36.7990 48.5071 51.1942
frequency: 36.6042 48.4739 51.1431 63.7806 76.0529 87.7290 95.3021 99.7492 110.1469 128.9534 136.8329 140.4290 154.0989 170.1392 181.9772 195.0562 204.1932 226.3741 234.7342 235.7660 260.6120 278.5552 283.7335 288.7758 297.0574 311.6660 318.6917 321.5337 331.4470 351.1785 362.8661 366.7724 379.9409 386.2495 391.1857 404.0541 412.0789 425.8258 436.3766 451.3990 456.6733 486.5102 490.3030 516.7681 524.7414 542.6523 565.6052 604.7472 622.0976 643.8148 664.5766 692.0282 703.9632 708.1558 740.2964 769.4281 787.0598 811.4918 814.9008 854.4143 867.6065 885.5504 894.0266 911.1908 934.7686 942.5213 947.0793 957.0493 966.7561 975.1070 1002.3261 1006.0066 1021.1946 1021.6758 1023.7618 1030.3688 1045.2633 1057.5446 1065.3788 1074.5772 1093.8174 1108.2761 1109.8635 1115.6553 1119.0140 1127.3693 1146.5445 1151.4917 1160.6464 1167.9999 1184.8139 1190.6042 1211.4426 1217.4921 1225.5058 1228.6327 1248.6339 1251.0046 1268.3721 1275.9600 1280.4308 1284.3889 1299.0043 1309.4370 1323.2879 1324.0069 1328.8186 1335.7757 1346.1686 1356.6874 1362.1356 1377.8146 1390.4969 1393.6183 1397.6056 1400.8562 1422.9700 1426.2326 1440.5897 1454.9497 1455.5345 1463.5708 1469.4849 1475.2591 1476.4057 1479.3179 1482.9117 1487.4467 1499.3349 1508.7105 1573.4529 1591.5017 1601.5808 1663.6472 2952.9439 2958.3722 2972.6175 2975.7388 2976.8943 2989.6040 2991.0678 2994.5375 3003.5654 3011.6001 3012.8027 3016.7063 3020.6854 3056.0686 3061.0645 3068.7645 3071.7710 3078.0687 3079.7107 3092.4133 3097.9866 3103.5047 3110.5441 3126.4146 3127.2227 3140.6415 3414.7422 3563.7199
redmass: 5.3595 2.6184 6.0125 2.3243 5.2086 2.5524 1.9968 1.5731 2.7235 2.4908 3.3385 2.8242 1.9024 2.7407 1.5559 2.1342 2.6571 2.8841 2.9215 2.2824 2.9887 3.6171 3.6358 3.0806 3.3377 2.6984 3.2066 2.3149 5.2694 3.4847 4.8497 4.6378 3.2122 2.1786 2.0691 1.5687 2.9793 3.4330 2.9658 3.1791 4.1782 4.4835 3.6460 3.4041 4.5193 4.2426 3.9526 4.1412 3.6289 5.6706 4.9859 3.7283 4.6411 4.2747 3.0617 4.0234 3.5283 4.2297 3.8150 2.8873 2.7053 2.5578 2.0830 2.2940 2.4264 2.3414 2.3672 3.0513 2.5002 2.0840 2.0662 2.6398 2.4988 2.8818 2.0565 2.1998 2.1871 3.1279 2.3015 1.9838 2.5388 1.3235 2.2899 2.4769 2.4264 2.4098 2.0838 1.4700 3.6973 2.0694 2.7224 1.7033 2.3864 2.1408 1.6016 1.5726 1.9874 2.1095 1.7253 1.4416 2.9176 1.2763 1.7802 1.3402 1.7780 1.2804 1.4021 1.4074 1.3508 1.4260 1.4118 1.3589 1.2039 1.2010 1.2102 1.1716 1.1033 1.1163 1.0912 1.0649 1.0826 1.0844 1.0765 1.0589 1.0580 1.0559 1.0523 1.0464 1.0546 1.0545 9.2746 9.8269 7.5555 12.0144 1.0809 1.0782 1.0447 1.0819 1.0364 1.0640 1.0332 1.0411 1.0664 1.0679 1.0655 1.0549 1.0789 1.0854 1.1017 1.0984 1.0991 1.0981 1.0985 1.0950 1.0952 1.0990 1.1012 1.0948 1.0978 1.1058 1.0641 1.0659
irintensity: 4.2034 4.2028 0.8305 1.5446 1.0981 0.5701 0.4796 0.5921 0.6356 1.6335 4.7279 1.9058 1.0872 7.3346 0.3296 0.4327 0.7087 0.4473 0.4103 0.3606 2.8206 3.3545 9.4985 2.5292 3.9178 6.6941 20.1764 18.0092 8.4217 21.1807 3.6089 49.0663 6.5323 22.9651 33.0437 59.1836 11.3594 17.1694 23.1762 6.2124 0.6542 0.9621 6.4725 1.9671 4.1960 0.6307 8.3795 10.8080 7.5235 9.9878 10.6997 1.0972 2.8172 10.2854 12.4277 2.5429 13.3690 3.3732 6.2258 7.0827 33.6519 12.5842 10.2919 10.7729 32.6768 3.4077 34.2213 3.6862 67.1758 59.1245 24.3323 28.0611 65.2485 131.0478 19.1105 38.7402 52.3224 17.5691 4.3194 0.3348 7.6904 1.9498 15.6435 19.0068 13.8987 7.9599 10.3875 2.3929 194.8645 49.6477 63.8174 5.3490 17.1740 35.6002 58.0630 84.8213 24.7624 16.9569 4.5228 9.2113 84.8205 4.1146 8.2118 6.3694 20.2103 3.7425 3.7638 11.7381 8.3162 1.1709 4.2172 66.9348 14.2679 6.4963 29.8190 54.1152 16.0364 25.6908 17.5277 8.5668 21.1723 7.3515 12.8130 3.8872 10.4997 39.9605 2.4714 15.1577 3.2475 13.4828 167.9413 104.3608 55.1257 339.4189 0.5403 5.8967 11.8148 11.4111 25.2984 28.0851 62.3332 19.3042 6.0761 12.3170 0.8001 30.0822 60.0424 11.7772 10.2465 19.1119 53.0057 13.7340 33.4929 2.9996 29.2759 36.1634 4.9895 14.4347 1.9103 11.1484 31.7197 11.2225
temp: 298.150 k
press: 1.00000 atm
elementType: 8 8 8 8 8 8 8 6 6 6 6 6 6 6 6 6 6 6 6 6 6 6 6 6 6 6 6 6 1 1 1 1 1 1 1 1 1 1 1 1 1 1 1 1 1 1 1 1 1 1 1 1 1 1 1 1
symmnumber: 1
zpe: 1199399.1 jmol-1
zpe.correction: 0.456827 hartree
zpe.thermalcorrener: 0.484811 hartree
zpe.thermalcorrenthalpy: 0.485755 hartree
zpe.thermalcorrgfe: 0.401262 hartree
zpe.sumelectzpe: -1341.427613 hartree
zpe.sumelectthermal: -1341.399628 hartree
zpe.sumelectthermalent: -1341.398684 hartree
zpe.sumelectthermalfe: -1341.483178 hartree
dipole: 1.9166 0.3226 5.3706
dipole: 5.7114
quadrupole: -160.1496 -191.4504 -168.3728
quadrupole: 14.1960 -7.1538 -15.7027
quadrupole: 13.1746 -18.1261 4.9515 14.1960 -7.1538 -15.7027
hfenergy: -1341.8844397 hartree
pointgroup: C01 [X(C21H28O7)]
dipole: 0.7398686 0.2538161 2.1065173 debye
polarizability: 271.9233915|-4.4423403|252.4375354|-7.2832083|-1.8913724|200.1101749 unknown
InChI: InChI=1S/C21H28O7/c1-9-6-12(22)18(25)19(3)11(9)7-13-20(4)17(19)15(24)16(27-5)10(2)21(20,26)8-14(23)28-13/h9,11-13,17,22,26H,6-8H2,1-5H3
charge 0 multiplicity 1
56 atoms
O  -0.018028 -2.795602 -0.488095
O  3.060895 -2.118868 0.860382
O  -1.35636 1.67493 -1.692726
O  -3.916134 2.418803 -1.687569
O  0.505454 2.753423 0.482365
O  3.320717 2.575238 -0.04861
O  1.024148 -3.592723 -2.348941
C  0.914931 -0.840895 0.897876
C  -1.331899 0.541709 0.508473
C  0.178598 0.330401 0.162921
C  -2.082084 -0.858949 0.366853
C  0.067073 -2.139986 0.861618
C  2.278853 -1.075723 0.148358
C  -1.403415 -1.927064 1.254386
C  -3.615854 -0.703173 0.58606
C  -1.961052 1.379594 -0.621362
C  1.208673 -0.528223 2.394345
C  1.016987 1.618359 0.247519
C  -1.603428 1.177451 1.905702
C  -4.194804 0.281666 -0.466609
C  2.090009 -1.691928 -1.26062
C  3.092474 0.21382 0.007874
C  -3.465743 1.659198 -0.534758
C  2.483594 1.45378 0.022529
C  -4.366529 -2.05307 0.484025
C  1.042105 -2.788725 -1.398302
C  4.585205 0.088302 -0.184882
C  2.869724 3.768952 -0.808579
H  0.181798 0.079087 -0.920197
H  -1.944433 -1.198562 -0.683581
H  0.546003 -2.891185 1.517442
H  -1.469853 -1.668648 2.328027
H  -1.916633 -2.895494 1.125072
H  -3.796206 -0.292795 1.600962
H  1.615876 -1.4192 2.906312
H  1.93253 0.298422 2.50148
H  0.300441 -0.234258 2.937438
H  -1.592162 0.417314 2.705108
H  -0.856773 1.951655 2.132431
H  -2.592238 1.660141 1.950497
H  -5.266791 0.469534 -0.275335
H  -4.120327 -0.174967 -1.474075
H  3.053183 -2.111333 -1.59327
H  1.817769 -0.908735 -1.992788
H  -3.700844 2.25562 0.365737
H  -4.118587 -2.575123 -0.459606
H  -4.123834 -2.729674 1.322228
H  -5.459417 -1.887928 0.500391
H  3.40345 -1.741287 1.709957
H  4.963452 0.915847 -0.807023
H  4.852974 -0.884632 -0.628782
H  5.122939 0.160003 0.782378
H  -3.142667 2.462295 -2.320177
H  3.769803 4.398284 -0.881193
H  2.060821 4.287297 -0.273743
H  2.526818 3.480222 -1.81942
